follows
type: ObjectProperty
inverse of: preceeds
domain: Class
  union of: Event
  union of: Action
range: Class
  union of: Event
  union of: Action
comment: Allows one or more events to be sequenced. Event A follows Event B

DiagnosticProcedure
type: Class
subclass of: MedicalAction
comment: Any procedure or test to diagnose a disease or disorder.

PreventiveTherapeutics
type: Class
subclass of: MedicalAction
comment: A therapy or action designed to prevent disease or ailment.

PalliativeCare
type: Class
subclass of: MedicalAction
comment: An approach that improves the quality of life of patients and their families facing the problems associated with life-threatening illness, through the prevention and relief of suffering by means of early identification and impeccable assessment and treatment of pain and other problems, physical, psychosocial, and spiritual’.

MedicalActionAvoidance
type: Class
subclass of: MedicalAction
comment: A recommendation of abstaining or avoiding any medical action that might normally be clinically prescribed.

Abdomen
type: Class
subclass of: RegionalDivision
comment: That portion of the body that lies between the THORAX and the PELVIS. (MSH)

Behaviour
type: Class
subclass of: Identity
comment: pattern of action by entities, living or not, within a system

BodyRegion
type: Class
comment: The subdivisions for the body region is based on the regional and functional aspect of the body.
is defined by: Colon Classification

CardiovascularSystem
type: Class
subclass of: FunctionalDivision
comment: The HEART and the BLOOD VESSELS by which BLOOD is pumped and circulated through the body. (MSH)

Cause
type: Class
subclass of: DescriptionTemplate
is defined by: event that provides the generative force for something

ChiefComplaint
type: Class
is defined by: The primary reason for a patient visit to a healthcare provider. (NCI)

Department
type: Class
subclass of: MedicalInstitution
comment: A specialized division of a large organization. (NCI)

DescriptionTemplate
type: Class
comment: Contains classes that are the major elements in describing the model

Diagnosis
type: Class
subclass of: MedicalAction
comment: Class containing the details of the diagnosis

Diet
type: Class
subclass of: Nutrition
comment: Regular course of eating and drinking adopted by a person or animal.

Disease
type: Class
comment: Any abnormal condition of the body or mind that causes discomfort, dysfunction, or distress to the person affected or those in contact with the person. The term is often used broadly to include injuries, disabilities, syndromes, symptoms, deviant behaviors, and atypical variations of structure and function.

Drinking
type: Class
subclass of: Nutrition
comment: The consumption of liquids.(MSH)

Effect
type: Class
subclass of: DescriptionTemplate
is defined by: a phenomenon that follows and is caused by some previous phenomenon

EmotionalStates
type: Class
subclass of: Identity
comment: The state of a person's emotions

Ethnicity
type: Class
subclass of: PopulationGroup
comment: a person's ethnic background

Event
type: Class
subclass of: Occurrence
comment: occurence of the scheduled happening
is defined by: A broad type for grouping activities, processes and states. https://uts.nlm.nih.gov/uts/umls/semantic-network/T051
is defined by: something that happens at a given place and time wordnet

Extremities [A01.378]
type: Class
subclass of: RegionalDivision

Eye
type: Class
subclass of: RegionalDivision
comment: The organ of sight or vision. (NCI)

Finding
type: Class
subclass of: MedicalAction
comment: The result of an examination or inquiry. (NCI)

FunctionalDivision
type: Class
subclass of: BodyRegion
is defined by: Colon Classification

GastrointestinalSystem
type: Class
subclass of: FunctionalDivision
comment: The system that includes the esophagus, stomach, small and large intestine, anus, liver, biliary tract, and pancreas. (NCI)

GenitoUrinarySystem
type: Class
subclass of: FunctionalDivision
comment: The body system that includes all organs involved in reproduction and in the formation and voidance of urine. (NCI)

Head
type: Class
subclass of: RegionalDivision
comment: The anterior and superior part of a human bearing the mouth, the brain and sensory organs. (NCI)

Identity
type: Class
comment: qualities, beliefs, personality, looks and/or expressions that distinguish a person or group

Joint
type: Class
subclass of: RegionalDivision
comment: The connection point between two bones or skeletal elements. The joint may be fixed or movable. (NCI)

LowerExtremity
type: Class
subclass of: Extremities [A01.378]
comment: The limb that is composed of the hip, thigh, leg and foot. (NCI)

MedicalEvent
type: Class
subclass of: Event
comment: Events occuring in a medical surronding

MedicalInstitution
type: Class
subclass of: Organisation
comment: institution where medicine is practiced

Neck
type: Class
subclass of: RegionalDivision
comment: The region that connects the head to the rest of the body. (NCI)

NervousSytem
type: Class
subclass of: FunctionalDivision
comment: Any component of the entire nerve apparatus, including the brain, spinal cord, spinal nerves, autonomic ganglia, and plexuses. ... (NCI)

Nutrition
type: Class
comment: provision to cells and organisms to support life

Occurrence
type: Class
comment: occurence of a fact or object in space-time

PatientStory
type: Class
subclass of: Occurrence
comment: Class that contain the individual patient stories

PharmaceuticalDosageForm
type: Class
comment: The form in which active and/or inert ingredient(s) are physically presented.

PharmaceuticalPreparation
type: Class
comment: A drug product that contains one or more active and/or inactive ingredients; it is intended to treat, prevent or alleviate the symptoms of disease. This term does not refer to the individual ingredients that make up the product. (NCI)

PhysicalAction
type: Class
subclass of: Action
comment: human physical activity consisting of voluntary bodily movement by skeletal muscles

PointOfView
type: Class
subclass of: DescriptionTemplate
comment: stakeholders of healthcare. For eg: doctor, patient, nurse, caretaker
is defined by: a mental position from which things are viewed Wordnet

PopulationGroup
type: Class
subclass of: Identity
comment: MeSH Unique ID D044382
comment: demographic classification of people

Race
type: Class
subclass of: PopulationGroup
comment: classification system used to categorize humans on the basis of hereditary physical traits

RegionalDivision
type: Class
subclass of: BodyRegion
is defined by: Colon Classification

RespiratorySystem
type: Class
subclass of: FunctionalDivision
comment: The organs involved in the exchange of carbon dioxide and oxygen including the trachea, bronchi, and lung parenchyma. (NCI)

Role
type: Class
subclass of: Identity
is defined by: normal or customary activity of a person in a particular social setting Wordnet

Scalp
type: Class
subclass of: RegionalDivision
comment: The skin which covers the top of the head and which is usually covered by hair. (NCI)

SocialEvent
type: Class
subclass of: Event
comment: Includes the social events such as parties, weddings etc

Symptom
type: Class
comment: An indication that a person has a condition or disease. Some examples of symptoms are headache, fever, fatigue, nausea, vomiting, and pain. (NCI)

Thorax
type: Class
subclass of: RegionalDivision
comment: The division of the body lying between the neck and the abdomen. (NCI)

UpperExtremity
type: Class
subclass of: Extremities [A01.378]
comment: The region of the body that includes the arm, the forearm, and hand. (NCI)

TherapeuticProcedure
type: Class
subclass of: MedicalAction
comment: All manners of treatment, be they pharmaceuticals, invasive procedures etc to relieve illness and injury in attempts to bring the body back to its normal state

MedicalAction
type: Class
subclass of: Action
comment: A clinically Prescribed procedure, therapy, intervention or recommendation

Agent
type: Class
comment: The Agent class is the class of agents; things that do stuff.

Group
type: Class
subclass of: Agent
comment: A class of Agents.

Organisation
type: Class
subclass of: Agent
comment: The foaf:Organization class represents a kind of foaf:Agent corresponding to social instititutions such as companies, societies etc.

Action
type: Class
subclass of: Occurrence
comment: The fact or process of doing something, typically to achieve an aim

Caregiver
type: NamedIndividual
type: Role
is defined by: a custodian who is hired to take care of something (property or a person) Wordnet

ChiefComplaintReporting
type: NamedIndividual
type: MedicalAction
part of event: EncounterWithMedicalInstitution
part of story: Patientstory1
is defined by: instance of an action. all the instances of the class are numbered,

Patient
type: NamedIndividual
type: Role
is defined by: a person who requires medical care

Person001
type: NamedIndividual
type: Person
experience symptom: Chill
has chief complaint: agent001complaint001
has role: Patient
participate in action: Story3Action001
participate in action: Story3Action002
participate in event: Event006
participate in event: Event007
participate in event: Event008
participate in event: Event009
age: 24
gender: male

Person007
type: NamedIndividual
type: Person
dietary habit: HighFat
drinking habit: AlcoholConsumption
has chief complaint: agent007complaint001
has previous disease: Obesity
has role: Patient
participate in action: Story1Action001
participate in action: Story1Action002
participate in action: Story1Action003
participate in action: Story1Action004
participate in action: Story1Action005
participate in action: Story1Action006
participate in event: Event001
participate in event: Event002
participate in event: Event003
participate in event: Event004
participate in event: Event005
participate in story: Patientstory1
age: 27
gender: male

Person008
type: NamedIndividual
type: Person
has behviour: IntravenousDrugUse
has behviour: TobaccoUse
has chief complaint: agent008complaint001
has role: Patient
previous disease: ArtialFibrillation
previous disease: Endocarditis
previous disease: HepatitisC
age: 41
gender: Female

Physician
type: NamedIndividual
type: Role
is defined by: a licensed medical practitioner Wordnet

Story1Action006
type: NamedIndividual
type: Action
action name: UndergoTreatment
action type: actionafterchiefcomplaint
consumed medication: Fenofibrate
dietary habit: LowFat
drinking habit: AlcoholCessation
other treatment: Exercise
part of story: Patientstory1
month duration: 1

VisitMedicalInstitution
type: NamedIndividual
type: MedicalEvent
includes action: PatientRegistration
includes action: PaymentOfFee
preceeds: EncounterWithMedicalInstitution
is defined by: instance of an event. all the instances of the class are numbered,

agent007complaint001
type: NamedIndividual
type: ChiefComplaint
affect: Arm
affect: Back
affect: Hand
complain name: Rash
department arrived at: Dermatology
diagnosis procedure: procedure001
part of story: Patientstory1
type of institution arrived: Clinic
week duration: 1

agent008complaint001
type: NamedIndividual
type: ChiefComplaint
affect: RightFoot
complain name: Pain
department arrived at: Emergency
diagnosis procedure: procedure002
day duration: 7

diagnosis001
type: NamedIndividual
type: Diagnosis
caused by: Hypertriglyceridemia
diagnosis present in story: Patientstory1
diagnosis procedure: diagnosis002
diagnosis description: EruptiveXanthomas

diagnosis002
type: NamedIndividual
type: Diagnosis
caused by: FrostBite
diagnosis present in story: Patientstory2
diagnosis description: Limb Ischemia

finding001
type: NamedIndividual
type: Finding
diagnosis present in story: diagnosis001
differential diagnosis: EruptiveHistiocytoma
differential diagnosis: MolluscumContagiosum
differential diagnosis: SebaceousHyperplasia
finding present in body region: HandDorsa
finding present in body region: UpperArm
finding present in body region: UpperBack
has cure: Fenofibrate
part of story: Patientstory1
colouration of finding: pink-yellow
finding description: Papule

finding002
type: NamedIndividual
type: Finding
diagnosis present in story: diagnosis002
differential diagnosis: ArtialFibrillation
differential diagnosis: FrostBite
differential diagnosis: Hypercoagulability
differential diagnosis: TrenchFoot
has cure: OccupationalTherapy
has cure: PhysicalTherapy
has cure: TetanusVaccine
part of story: Patientstory2
finding description: Limb Ischemia