Ontobio: a biographical ontology
type: Ontology
version IRI: https://w3id.org/ontobio/1.0
creator: Biswanath Dutta
creator: Shakeeb Arzoo
date: October 5, 2023
description: Ontobio is a comprehensive biographical ontology founded upon the Linked Data Principles. It gathers vocabularies from a variety of domains (such as healthcare, food, travel, bibliographic, CV ontologies) to encapsulate the smallest units of biographical information. Ontobio is conceived as an integrative model, designed using a known methodology to ensure robustness and interoperability, and produced in various serialization formats such as OWL, RDF/XML, TTL, etc. It is populated with the biographical data of S. R. Ranganathan, which can be accessed here. It can be used by anyone to encode biographical data in a graph-based model, or develop a SPARQL endpoint.
comment: Biography Ontology
preferred namespace prefix: ontobio
Competency Question: Sample competency questions: When was SRR born? Where was SRR’s birthplace? Which educational institution did SRR attend? What was SRR’s parent’s occupation? How many siblings did SRR have? What was SRR’s family’s socioeconomic status? How did SRR’s colleagues describe them? How many books did SRR publish? What inspired SRR’s work? More competency questions may be accessed from https://w3id.org/ontobio

creator
type: AnnotationProperty
comment: An entity responsible for making the resource.

date
type: AnnotationProperty
comment: A name given to the resource.

description
type: AnnotationProperty
comment: An account of the resource.

title
type: AnnotationProperty
scope note: Used to describe the title of a bibliographic resource.

is defined by

label
comment: rdfs:label is an instance of rdf:Property that may be used to provide a human-readable version of a resource's name.

see also
type: AnnotationProperty

alternative label
type: AnnotationProperty

editorial note
type: AnnotationProperty

hidden label
type: AnnotationProperty

note
type: AnnotationProperty

preferred label
type: AnnotationProperty

scope note
type: AnnotationProperty

Competency Question
type: AnnotationProperty

contributor
type: ObjectProperty
inverse of: contributor of
domain: Thing
range: Agent
scope note: Used to link a bibliographic item to one of its contributor: can be an author, an editor, a publisher.

creator
type: ObjectProperty
inverse of: creator of
domain: Thing
range: Agent
comment: An entity responsible for making the resource.

has Part
type: ObjectProperty
sub property of: relation
inverse of: is Part Of
type: TransitiveProperty
domain: Thing
range: Thing
comment: A related resource that is included either physically or logically in the described resource.(https://www.dublincore.org/specifications/dublin-core/dcmi-terms/#http://purl.org/dc/terms/isPartOf)

has version
type: ObjectProperty
sub property of: relation
inverse of: is version of
domain: Thing
range: Information Resource
comment: A related resource that is a version, edition, or adaptation of the described resource.

is Part Of
type: ObjectProperty
sub property of: relation
type: TransitiveProperty
domain: Thing
range: Thing
comment: A related resource in which the described resource is physically or logically included.(https://www.dublincore.org/specifications/dublin-core/dcmi-terms/#http://purl.org/dc/terms/isPartOf)

is version of
type: ObjectProperty
sub property of: relation
domain: Information Resource
range: Thing
comment: A related resource of which the described resource is a version, edition, or adaptation.
comment: Changes in version imply substantive changes in content rather than differences in format.

publisher
type: ObjectProperty
inverse of: publisher of
domain: Thing
range: Agent
comment: An entity responsible for making the resource available.
scope note: Used to link a bibliographic item to its publisher

relation
type: ObjectProperty
type: SymmetricProperty
domain: Thing
range: Thing

subject
type: ObjectProperty
inverse of: subject of
domain: Thing
range: Class
  union of: Academic discipline
  union of: Information Resource
comment: A topic of the resource.
scope note: Used to describe the subject of a bibliographic resource.

editor
type: ObjectProperty
sub property of: contributor
domain: Information Resource
range: Agent
comment: An agent having managerial and sometimes policy-making responsibility for the editorial part of a publishing firm or of a newspaper, magazine, or other publication.

presented at
type: ObjectProperty
domain: Document
comment: Relates a document to an event; for example, a paper to a conference.

acquaintance of
type: ObjectProperty
sub property of: social relation of
type: SymmetricProperty
domain: Person
range: Person
comment: A person having more than slight or superficial knowledge of this person but short of friendship.

apprentice to
type: ObjectProperty
sub property of: social relation of
inverse of: mentor of
domain: Person
range: Person
comment: A person to whom this person serves as a trusted counselor or teacher.

close friend of
type: ObjectProperty
sub property of: social relation of
type: SymmetricProperty
domain: Person
range: Person
comment: A person who shares a close mutual friendship with this person.

colleague of
type: ObjectProperty
sub property of: social relation of
type: SymmetricProperty
domain: Person
range: Person
comment: A person who is a member of the same profession as this person.

engaged to
type: ObjectProperty
type: SymmetricProperty
domain: Person
range: Person
comment: A person to whom this person is betrothed.

friend of
type: ObjectProperty
sub property of: social relation of
type: SymmetricProperty
domain: Person
range: Person
comment: A person who shares mutual friendship with this person.

influenced by
type: ObjectProperty
domain: Person
range: Person
comment: A person who has influenced this person.

mentor of
type: ObjectProperty
sub property of: social relation of
domain: Person
range: Person
comment: A person who serves as a trusted counselor or teacher to this person.

neighbor of
type: ObjectProperty
sub property of: social relation of
type: SymmetricProperty
domain: Person
range: Person
comment: A person who lives in the same locality as this person.

works with
type: ObjectProperty
sub property of: social relation of
domain: Person
range: Person
comment: A person who works for the same employer as this person.

has work history
type: ObjectProperty
inverse of: work history of
domain: Person
range: Work History

dedicated to
type: ObjectProperty
domain: Thing
range: Person
comment: A thing dedicated to a person.

treated at
type: ObjectProperty
domain: Class
  union of: Person
  union of: Health Record
range: Medical Organization
comment: Indicates the medical organization where a person was treated as part of their health record.

has Unit
type: ObjectProperty
inverse of: unit of
domain: Organization
range: Organizational Unit
comment: Indicates a unit which is part of this Organization, e.g. a Department within a larger Organization.

unit of
type: ObjectProperty
domain: Organizational Unit
range: Organization
comment: Indicates an Organization of which this Unit is a part, e.g. a Department within a larger Organization.

depiction
type: ObjectProperty
inverse of: depicts
domain: Thing
range: Thing
comment: A depiction of some thing.
scope note: Used to link an agent with an image that depict it.

depicts
type: ObjectProperty
domain: Thing
range: Thing
comment: The depiction property is a relationship between a thing and an Image that depicts it. As such it is an inverse of the depicts relationship.

interest
type: ObjectProperty
inverse of: is interest of
domain: Person
range: Thing
comment: A page about a topic of interest to this person.

known for
type: ObjectProperty
domain: Agent
range: Thing
comment: Work, historic event, etc that the subject is known for.

affiliation
type: ObjectProperty
domain: Class
  union of: Person
  union of: Honorary Work
  union of: Professional Affiliation
range: Organization
comment: An organization that this person is affiliated with. For example, a school/university, a club, or a team.

associated anatomy
type: ObjectProperty
domain: Class
  union of: Medical Condition
  union of: Health Record
range: Anatomical Region
comment: The anatomy of the underlying organ system or structures associated with this entity.

birth place
type: ObjectProperty
inverse of: birth place of
type: FunctionalProperty
domain: Person
range: Place
comment: The place where the person was born.

contained in place
type: ObjectProperty
inverse of: contains place
domain: Place
range: Place
comment: The basic containment relation between a place and one that contains it.

contains place
type: ObjectProperty
type: TransitiveProperty
domain: Place
range: Place
comment: The basic containment relation between a place and another that it contains.

death place
type: ObjectProperty
inverse of: death place of
type: FunctionalProperty
domain: Person
range: Place
comment: The place where the person died.

founder
type: ObjectProperty
inverse of: founded by
domain: Person
range: Organization
comment: A person who founded this organization.

founding location
type: ObjectProperty
domain: Organization
range: Place
comment: The place where the Organization was founded.

gender
type: ObjectProperty
domain: Person
range: Gender Type
comment: Gender of something, typically a Person, but possibly also fictional characters, animals, etc.

has occupation
type: ObjectProperty
inverse of: is occupation of
domain: Person
range: Occupation
comment: A Person's occupation.

job title
type: ObjectProperty
domain: Work History
range: Title
comment: The job title of the person (for example, Financial Manager).

knows language
type: ObjectProperty
domain: Person
range: Language
comment: Of a Person, and less typically of an Organization, to indicate a known language

member
type: ObjectProperty
inverse of: member Of
domain: Agent
range: Agent
comment: A member of an Organization. Organizations can be members of organizations.

member Of
type: ObjectProperty
domain: Agent
range: Agent
comment: An Organization to which this Person or Organization belongs.

mentions
type: ObjectProperty
domain: Creative Work
range: Thing
comment: Indicates that the CreativeWork contains a reference to, but is not necessarily about a concept.

translation of work
type: ObjectProperty
domain: Information Resource
range: Information Resource
comment: The work that this work has been translated from.

appeared In
type: ObjectProperty
domain: Information Resource
range: Information Resource
comment: An resource that appeared in a publication.

contributor of
type: ObjectProperty
domain: Agent
range: Thing

creator of
type: ObjectProperty
domain: Agent
range: Thing

has article
type: ObjectProperty
inverse of: published in
domain: Collection
range: Document

published in
type: ObjectProperty
domain: Document
range: Collection

publisher of
type: ObjectProperty
domain: Agent
range: Thing

subject of
type: ObjectProperty
domain: Class
  union of: Academic discipline
  union of: Information Resource
range: Thing
comment: A topic of the resource for.

awarded to
type: ObjectProperty
inverse of: has award
domain: Award
range: Agent
comment: Indicates the connection through which the award is given to the person.

belonged to
type: ObjectProperty
domain: Thing
range: Agent
comment: A thing belonging to an individual.

birth place of
type: ObjectProperty
type: InverseFunctionalProperty
domain: Place
range: Person

causal context
type: ObjectProperty
domain: Class
  union of: Event
  union of: Action
range: Thing
comment: The context or situation giving rise to a development

conferred by
type: ObjectProperty
domain: Award
range: Agent
comment: An award bestowed by an agent to another.

contains city
type: ObjectProperty
sub property of: contains place
domain: Place
range: City

contains country
type: ObjectProperty
sub property of: contains place
domain: Place
range: Country

contains locality
type: ObjectProperty
sub property of: contains place
domain: Place
range: Locality

contains residence
type: ObjectProperty
sub property of: contains place
domain: Place
range: Residence

contains state
type: ObjectProperty
sub property of: contains place
domain: Place
range: State

contains village
type: ObjectProperty
sub property of: contains place
domain: Place
range: Village

death place of
type: ObjectProperty
type: InverseFunctionalProperty
domain: Place
range: Person

degree awarded by
type: ObjectProperty
sub property of: educational details
domain: Education
range: Organization
comment: An educational degree awarded by an organization.

degree awarded in
type: ObjectProperty
sub property of: educational details
domain: Education
range: Academic discipline
comment: An educational degree in a particular subject awarded by an organization.

degree awarded to
type: ObjectProperty
sub property of: educational details
inverse of: has degree
domain: Education
range: Person
comment: An educational degree awarded to a person.

dress worn in
type: ObjectProperty
domain: Dressing Habit
range: Class
  union of: Organization
  union of: Place
comment: A particular style of dressing associate with a place.

educational details
type: ObjectProperty
domain: Education
range: Thing
comment: The educational details of a person.

employed at
type: ObjectProperty
domain: Employment
range: Organization
comment: The state of being employed by an organization.

endowed
type: ObjectProperty
inverse of: is endowed by
domain: Agent
range: Endowment
comment: Indicates something directly or indirectly funded or sponsored through a Grant.

endowment to
type: ObjectProperty
domain: Endowment
range: Agent
comment: Specifies the organization to which an endowment, donation, or funding was made, linking an endowment to the recipient.

ethnicity of
type: ObjectProperty
inverse of: has ethnicity
domain: Ethnic Group
range: Person
comment: The ethnic group to which the person belongs.

followed by
type: ObjectProperty
inverse of: preceded by
type: FunctionalProperty
type: AsymmetricProperty
type: IrreflexiveProperty
domain: Thing
range: Thing
comment: A event succeeding another.
alternative label: next of

follows religion
type: ObjectProperty
domain: Person
range: Religion
comment: A link between the person and the religion they follow.

founded by
type: ObjectProperty
domain: Organization
range: Person
comment: The organization founded by a person.

gifted by
type: ObjectProperty
domain: Thing
range: Agent
comment: The transfer of an object from the donor.

gifted to
type: ObjectProperty
domain: Thing
range: Agent
comment: The receiving of an object by the beneficiary.

guest of
type: ObjectProperty
inverse of: has guest
domain: Person
range: Person
comment: A person who is a guest of another

has accessory.
type: ObjectProperty
sub property of: has cloth item
domain: Dressing Habit
range: Accessory
comment: Relates a dressing habit or style to an additional item or ornament worn to complement an outfit.

has activity
type: ObjectProperty
domain: Thing
range: Activity
comment: An event entailing a particular activity.

has aunt
type: ObjectProperty
sub property of: has family relation
inverse of: is aunt of
domain: Person
range: Woman
property chain axiom: has parent
property chain axiom: has sister
comment: Indicates the familial relationship where an individual having an aunt is a woman who is a sibling of a parent.

has award
type: ObjectProperty
domain: Agent
range: Award
comment: The act of receiving an award.

has body garment
type: ObjectProperty
sub property of: has cloth item
domain: Dressing Habit
range: Body Garment
comment: Relates a dressing habit or style to the specific clothing item covering the entire body length.

has body physique
type: ObjectProperty
sub property of: physical detail
domain: Class
  union of: Person
  union of: Physical Appearance
range: Body Physique
comment: Specifies the body type of a person (fat, thin, muscular, lean, etc.) as part of their physical appearance.

has bottomwear
type: ObjectProperty
sub property of: has cloth item
domain: Dressing Habit
range: Bottomwear
comment: Relates a dressing habit or style to the specific clothing item worn on the lower body.

has brother
type: ObjectProperty
sub property of: has sibling
inverse of: is brother of
domain: Person
range: Man
comment: Indicates the familial relationship where an individual has a brother, who is a male sibling sharing at least one parent in common.

has brother-in-law
type: ObjectProperty
sub property of: has in-law
inverse of: is brother-in-law of
domain: Person
range: Man
property chain axiom: has spouse
property chain axiom: has brother
comment: Indicates the familial relationship between an individual and their spouse's brother.

has child
type: ObjectProperty
equivalent property: is parent of
sub property of: has family relation
inverse of: is child of
domain: Person
range: Person
comment: Indicates the family relationship between an individual and their offspring.

has cloth item
type: ObjectProperty
domain: Dressing Habit
range: Clothing Type
comment: A particular clothing item being used as a part of a dressing habit.

has cousin
type: ObjectProperty
sub property of: has family relation
inverse of: is cousin of
domain: Person
range: Person
comment: Indicates the family relationship where an individual has a cousin who is typically the child of one's parents' siblings.

has daughter
type: ObjectProperty
sub property of: has child
inverse of: is daughter of
domain: Person
range: Woman
comment: Indicates the family relationship between an individual and their female child.

has decorative mark
type: ObjectProperty
sub property of: physical detail
domain: Class
  union of: Person
  union of: Physical Appearance
range: Decorative Mark

has degree
type: ObjectProperty
domain: Person
range: Education
comment: The act of person holding an educational degree.

has dress style
type: ObjectProperty
domain: Person
range: Dressing Habit
comment: A person having a particular style of dressing.

has ethnicity
type: ObjectProperty
domain: Person
range: Ethnic Group
comment: Specifies the ethnicity or ethnic background of a person.

has eye color
type: ObjectProperty
sub property of: physical detail
domain: Class
  union of: Person
  union of: Physical Appearance
range: Eye Color
comment: Specifies the eye color of a person as part of their physical appearance.

has facial feature
type: ObjectProperty
sub property of: physical detail
domain: Class
  union of: Person
  union of: Physical Appearance
range: Facial Feature
comment: Specifies any other distinguishing feature in a person's face.

has family relation
type: ObjectProperty
domain: Person
range: Person
comment: A connection formed through blood ties, marriage, and adoption.

has father
type: ObjectProperty
sub property of: has parent
inverse of: is father of
domain: Person
range: Man
comment: Indicates the familial relationship where an individual has a father, who is the male parent of the individual.

has father-in-law
type: ObjectProperty
sub property of: has in-law
inverse of: is father-in-law of
domain: Person
range: Man
property chain axiom: has spouse
property chain axiom: has father
comment: Indicates the familial relationship between an individual and their spouse's father.

has female partner
type: ObjectProperty
sub property of: has partner
inverse of: is female partner in
domain: Marriage
range: Woman
comment: Relates an individual to their female spouse or partner within a marriage or similar relationship.

has food habit
type: ObjectProperty
domain: Person
range: Food Habit
comment: Relates an individual to their typical dietary patterns or eating habits.

has food item
type: ObjectProperty
domain: Meal
range: Food Item
comment: Indicates the food item contained in a meal.

has footwear
type: ObjectProperty
sub property of: has cloth item
domain: Dressing Habit
range: Footwear
comment: Relates a dressing habit or style to the specific clothing item worn on the foot.

has grandparent
type: ObjectProperty
sub property of: has family relation
inverse of: is grandparent of
domain: Person
range: Person
property chain axiom: has parent
comment: Indicates the family relationship where an individual has a grandparent, who is typically the parent of one's parent(s).

has grandfather
type: ObjectProperty
sub property of: has grandparent
inverse of: is grandfather of
domain: Person
range: Man
property chain axiom: has parent
property chain axiom: has father
comment: Indicates the familial relationship where an individual has a grandfather, who is the male parent of one's parent(s).

has grandmother
type: ObjectProperty
sub property of: has grandparent
inverse of: is grandmother of
domain: Person
range: Woman
property chain axiom: has parent
property chain axiom: has mother
comment: Indicates the familial relationship where an individual has a grandmother, who is the female parent of one's parent(s).

has guest
type: ObjectProperty
domain: Person
range: Person
comment: A person who acts as a host towards a guest.

has hair style
type: ObjectProperty
sub property of: physical detail
domain: Class
  union of: Person
  union of: Physical Appearance
range: Hair Style

has husband
type: ObjectProperty
equivalent property: is wife of
sub property of: has spouse
inverse of: is husband of
domain: Person
range: Man
property chain axiom: is female partner in
property chain axiom: has male partner
comment: Indicates the marital relationship where an individual has a husband, who is their male partner in a marriage.

Specificies any identifyiing mark on the body of a person as commonly found in official documents.
type: ObjectProperty
sub property of: physical detail
domain: Class
  union of: Person
  union of: Physical Appearance
range: Identification Mark
label: has identification mark

has in-law
type: ObjectProperty
sub property of: has family relation
inverse of: is in-law of
domain: Person
range: Person
comment: Indicates the relationship between an individual and their relatives by marriage.

has item
type: ObjectProperty
inverse of: is item of
domain: Agent
range: Class
  union of: Information Resource
  union of: Artifact
comment: Indicates the link through which an agent holds an item.

has male partner
type: ObjectProperty
sub property of: has partner
inverse of: is male partner in
domain: Marriage
range: Man
comment: Relates an individual to their male spouse or partner within a marriage or similar relationship.

has meal
type: ObjectProperty
domain: Person
range: Meal
comment: Denotes the link between a person and a meal, indicating the meal consumed or preferred by the person.

has mother
type: ObjectProperty
sub property of: has parent
inverse of: is mother of
domain: Person
range: Woman
comment: Indicates the familial relationship where an individual has a mother, who is the female parent of the individual

has mother-in-law
type: ObjectProperty
sub property of: has in-law
inverse of: is mother-in-law of
domain: Person
range: Woman
property chain axiom: has spouse
property chain axiom: has mother
comment: Indicates the familial relationship between an individual and their spouse's mother.

has nephew.
type: ObjectProperty
sub property of: has family relation
inverse of: is nephew of
domain: Person
range: Man
property chain axiom: has sibling
property chain axiom: has son
comment: Indicates the familial relationship where an individual has a nephew, who is typically the son of one's sibling.

has niece
type: ObjectProperty
sub property of: has family relation
inverse of: is niece of
domain: Person
range: Woman
property chain axiom: has sibling
property chain axiom: has daughter
comment: Indicates the familial relationship where an individual has a niece, who is typically the daughter of one's sibling.

has outerwear
type: ObjectProperty
sub property of: has cloth item
domain: Dressing Habit
range: Outerwear
comment: Relates a dressing habit or style to the specific clothing item worn over clothes.

has parent
type: ObjectProperty
sub property of: has family relation
inverse of: is parent of
domain: Person
range: Person
comment: Indicates the familial relationship where an individual has a parent, indicating the direct biological or adoptive connection between an individual and their progenitor.

has partner
type: ObjectProperty
inverse of: is partner in
domain: Marriage
range: Person
comment: Relates an individual to their spouse or partner in a marriage or similar relationship.

has personality trait
type: ObjectProperty
inverse of: is personality trait of
domain: Person
range: Personality Trait
comment: Relates an individual to a specific personality trait or set of traits they possess or manifest.

has physical appearance
type: ObjectProperty
domain: Person
range: Physical Appearance
comment: Relates an individual to their observable physical attributes or characteristics.

has quote
type: ObjectProperty
inverse of: is quote of
domain: Person
range: Quote
comment: Relates an individual to their quote or saying.
alternative label: notable saying

has routine
type: ObjectProperty
domain: Person
range: Daily Routine
comment: Relates an individual to their typical or habitual activities performed on a daily basis.

has sexual orientation
type: ObjectProperty
domain: Person
range: Sexual Orientation
comment: Relates an individual to their sexual orientation or preference.

has sibling
type: ObjectProperty
sub property of: has family relation
inverse of: is sibling of
domain: Person
range: Person
comment: Indicates the familial relationship where an individual has a sibling, either a brother or a sister who shares at least one parent in common.

has sister
type: ObjectProperty
sub property of: has sibling
inverse of: is sister of
domain: Person
range: Woman
comment: Indicates the familial relationship where an individual has a sister, who is a female sibling sharing at least one parent in common.

has sister-in-law
type: ObjectProperty
sub property of: has in-law
inverse of: is sister-in-law of
domain: Person
range: Woman
property chain axiom: has spouse
property chain axiom: has sister
comment: Indicates the familial relationship between an individual and their spouse's sister.

has skin color
type: ObjectProperty
sub property of: physical detail
domain: Class
  union of: Person
  union of: Physical Appearance
range: Skin Color
comment: Specifies the skin color of a person as part of their physical appearance.

has son
type: ObjectProperty
sub property of: has child
inverse of: is son of
domain: Person
range: Man
comment: Indicates the family relationship between an individual and their male child.

has spouse
type: ObjectProperty
equivalent property: is spouse of
sub property of: has family relation
domain: Person
range: Person
comment: Indicates the marital relationship between two individuals.

has topwear
type: ObjectProperty
sub property of: has cloth item
domain: Dressing Habit
range: Topwear
comment: Relates a dressing habit or style to the specific clothing item worn on the upper body.

has uncle
type: ObjectProperty
sub property of: has family relation
inverse of: is uncle of
domain: Person
range: Man
property chain axiom: has parent
property chain axiom: has brother
comment: Indicates the familial relationship where an individual having an uncle is a man who is a sibling of a parent.

has undergarment
type: ObjectProperty
sub property of: has cloth item
domain: Dressing Habit
range: Undergarment
comment: Relates a dressing habit or style to the specific clothing item worn which directly touches the skin.

has wife
type: ObjectProperty
equivalent property: is husband of
sub property of: has spouse
inverse of: is wife of
domain: Person
range: Woman
property chain axiom: is male partner in
property chain axiom: has female partner
comment: Indicates the marital relationship where an individual has a wife, who is their female partner in a marriage.

has work place
type: ObjectProperty
inverse of: workplace of
domain: Person
range: Organization
comment: Relates an individual to their work place or organization.

honor title
type: ObjectProperty
domain: Award
range: Honorary Title
comment: The association between an award and an honorary title. It specifies that the award grants or is associated with a specific honorary title.

in honor of
type: ObjectProperty
domain: Class
  union of: Award
  union of: Endowment
range: Agent
comment: An award or endowment made in honor of an individual.

inspiration of
type: ObjectProperty
inverse of: inspired by
domain: Thing
range: Thing
comment: Relates an entity to the source or origin that influenced or served as inspiration for it.

inspired by
type: ObjectProperty
domain: Thing
range: Thing
comment: A thing inspired by another thing.

involves participant
type: ObjectProperty
domain: Thing
range: Participant
comment: Relates an activity, event, or process to an individual or entity taking part or participating in it.

is aunt of
type: ObjectProperty
sub property of: is family relation of
domain: Woman
range: Person
property chain axiom: is sister of
property chain axiom: has child

is branch of
type: ObjectProperty
domain: Academic discipline
range: Academic discipline
comment: It indicates that one academic discipline is a branch or subfield of another broader discipline.

is brother-in-law of
type: ObjectProperty
sub property of: is in-law of
domain: Man
range: Person
property chain axiom: is brother of
property chain axiom: has spouse

is brother of
type: ObjectProperty
sub property of: is sibling of
domain: Man
range: Person

is child of
type: ObjectProperty
sub property of: is family relation of
domain: Person
range: Person

is cousin of
type: ObjectProperty
sub property of: is family relation of
domain: Person
range: Person

is daughter of
type: ObjectProperty
sub property of: is child of
domain: Woman
range: Person

is endowed by
type: ObjectProperty
domain: Endowment
range: Agent

is family relation of
type: ObjectProperty
domain: Person
range: Person

is father-in-law of
type: ObjectProperty
sub property of: is in-law of
domain: Man
range: Person
property chain axiom: is father of
property chain axiom: has spouse

is father of
type: ObjectProperty
sub property of: is parent of
domain: Man
range: Person

is female partner in
type: ObjectProperty
sub property of: is partner in
domain: Woman
range: Marriage

is grandparent of
type: ObjectProperty
sub property of: is family relation of
domain: Person
range: Person
property chain axiom: is parent of

is grandfather of
type: ObjectProperty
sub property of: is grandparent of
domain: Man
range: Person
property chain axiom: is father of
property chain axiom: is parent of

is grandmother of
type: ObjectProperty
sub property of: is grandparent of
domain: Woman
range: Person
property chain axiom: is mother of
property chain axiom: is parent of

is health record of
type: ObjectProperty
inverse of: has health record
domain: Health Record
range: Person

is husband of
type: ObjectProperty
sub property of: is spouse of
domain: Man
range: Person
property chain axiom: is male partner in
property chain axiom: has female partner

is in-law of
type: ObjectProperty
sub property of: is family relation of
domain: Person
range: Person

is interest of
type: ObjectProperty
domain: Thing
range: Person
comment: A thing or activity of interest to a person.

is item of
type: ObjectProperty
domain: Class
  union of: Information Resource
  union of: Artifact
range: Agent

is male partner in
type: ObjectProperty
sub property of: is partner in
domain: Man
range: Marriage

is mother-in-law of
type: ObjectProperty
sub property of: is in-law of
domain: Woman
range: Person
property chain axiom: is mother of
property chain axiom: has spouse

is mother of
type: ObjectProperty
sub property of: is parent of
domain: Woman
range: Person

is nephew of
type: ObjectProperty
sub property of: is family relation of
domain: Man
range: Person
property chain axiom: is son of
property chain axiom: has sibling

is niece of
type: ObjectProperty
sub property of: is family relation of
domain: Woman
range: Person
property chain axiom: is daughter of
property chain axiom: has sibling

is occupation of
type: ObjectProperty
domain: Occupation
range: Person

is parent of
type: ObjectProperty
sub property of: is family relation of
domain: Person
range: Person

is partner in
type: ObjectProperty
domain: Person
range: Marriage

is personality trait of
type: ObjectProperty
domain: Personality Trait
range: Person

is pet of
type: ObjectProperty
inverse of: has pet
domain: Pet
range: Person
comment: companion to the owner

is quote of
type: ObjectProperty
domain: Quote
range: Person

is religious practice in
type: ObjectProperty
domain: Religious Activity
range: Religion
comment: Specifies the association of a religious activity as followed in a particular religion or belief system.

is sibling of
type: ObjectProperty
sub property of: is family relation of
type: IrreflexiveProperty
domain: Person
range: Person

is sister-in-law of
type: ObjectProperty
sub property of: is in-law of
domain: Woman
range: Person
property chain axiom: is sister of
property chain axiom: has spouse

is sister of
type: ObjectProperty
sub property of: is sibling of
domain: Woman
range: Person

is son of
type: ObjectProperty
sub property of: is child of
domain: Man
range: Person

is spouse of
type: ObjectProperty
sub property of: is family relation of
domain: Person
range: Person

is type of
type: ObjectProperty
domain: Food
range: Food Habit
comment: Relates a food as belonging to its food type (veg., non veg., etc.)

is uncle of
type: ObjectProperty
sub property of: is family relation of
domain: Man
range: Person
property chain axiom: is brother of
property chain axiom: has child

is wife of
type: ObjectProperty
sub property of: is spouse of
domain: Woman
range: Person
property chain axiom: is female partner in
property chain axiom: has male partner

made of material
type: ObjectProperty
inverse of: materialUsedIn
domain: Clothing Type
range: Clothing Material
comment: Indicates the type of clothing material used in a cloth item.

materialUsedIn
type: ObjectProperty
domain: Clothing Material
range: Clothing Type
comment: material used in

meal consumed in
type: ObjectProperty
domain: Meal
range: Class
  union of: Organization
  union of: Place
comment: Relates a meal to the place where it was consumed.

physical detail
type: ObjectProperty
domain: Class
  union of: Person
  union of: Physical Appearance
range: Physical Trait
comment: Relates a person and their physical appearance to specific physical features or characteristics

place of publication
type: ObjectProperty
domain: Information Resource
range: Place
comment: Specifies the location where a book, article, or publication was printed or issued.

preceded by
type: ObjectProperty
type: InverseFunctionalProperty
type: AsymmetricProperty
type: IrreflexiveProperty
domain: Thing
range: Thing
comment: A event preceeding another.
alternative label: previous of

quote from
type: ObjectProperty
domain: Quote
range: Information Resource
comment: A quote occuring in a document

reason for travel
type: ObjectProperty
domain: Travel
range: Travel Purpose
comment: Indicates the reason or purpose behind a travel. It is similar to the information given for visa purposes.

resided in
type: ObjectProperty
domain: Person
range: Residence
comment: A residence for a person.

social relation of
type: ObjectProperty
domain: Person
range: Person
comment: Relates a person to their social relationships with others as part of a larger network.

specialization
type: ObjectProperty
equivalent property: field of work
inverse of: specialization of
domain: Thing
range: Academic discipline

specialization of
type: ObjectProperty
domain: Academic discipline
range: Thing
comment: A particular academic discipline that is a speciality of a thing.

trait manifested in
type: ObjectProperty
domain: Personality Trait
range: Thing
comment: Indicates the link through which a personality trait of a person is displayed or expressed according to the activity or situation.

trait observed by
type: ObjectProperty
domain: Personality Trait
range: Person
comment: Indicates the personality trait of a person as observed by another.

travel from
type: ObjectProperty
domain: Travel
range: Place
comment: Indicates the place a travel originates or departs from within a travel instance

travel to
type: ObjectProperty
domain: Travel
range: Place
comment: Specifies the place a travel terminates to from within a travel instance

travel undertaken by
type: ObjectProperty
inverse of: undertook travel
domain: Travel
range: Person
comment: Indicates the travel instance as undertaken by a person.

treated by
type: ObjectProperty
domain: Health Record
range: Agent
comment: Indicates the person who administered the treatement.

undertook travel
type: ObjectProperty
domain: Person
range: Travel
comment: Relates a person to the travel they have undertaken or participated in.

use of
type: ObjectProperty
inverse of: used in
domain: Activity
range: Thing
comment: Indicates an activity that entails the use of a particular thing.

used in
type: ObjectProperty
domain: Thing
range: Activity
comment: Indicates the use of a particular thing in an activity.

work history of
type: ObjectProperty
domain: Work History
range: Person
comment: Specifies the work history or employment record associated with an individual.

workplace of
type: ObjectProperty
domain: Organization
range: Person
comment: Relates a workplace to an individual associated with it, typically denoting employment or affiliation.

diagnosed with
type: ObjectProperty
domain: Class
  union of: Person
  union of: Health Record
range: Medical Condition
comment: The phrase "diagnosed with" typically indicates that a medical condition has been identified or diagnosed in a patient. It is often used in medical reports and records to document a patient's medical history and current health status.

has health record
type: ObjectProperty
domain: Person
range: Health Record
comment: The term "has health record" can refer to a variety of things, depending on the context. In general, it means that the person has some kind of record or documentation of their medical history or health status.

has symptom
type: ObjectProperty
domain: Health Record
range: Symptom
comment: Any sensation or change in bodily function that is experienced by a patient and is associated with a particular disease.
comment: The attribute 'has symptom' is used to indicate that a person or a patient has reported or is showing a particular symptom. It is typically used in medical contexts to describe a sign or indication of a disease or illness. For example, a patient may have a fever, cough, or headache, which are all symptoms of various illnesses. By documenting the symptoms a patient is experiencing, healthcare providers can make a more accurate diagnosis and develop a treatment plan.

has treatment procedure
type: ObjectProperty
domain: Health Record
range: Treatment Procedure
comment: "Has treatment procedure" refers to the medical procedure or intervention that has been prescribed or recommended for a patient's medical condition. It includes any surgical, therapeutic, or diagnostic procedure that a healthcare professional has planned to perform on the patient as part of their treatment plan. The details of the treatment procedure are usually documented in the patient's medical record, including the name of the procedure, the date it was performed, and any other relevant information such as the location, anesthesia used, and the outcome of the procedure.

field of work
type: ObjectProperty
domain: Thing
range: Academic discipline
comment: Specialization of a person or organization

has pet
type: ObjectProperty
domain: Person
range: Pet
comment: pet that a person owns

owner of
type: ObjectProperty
domain: Agent
range: Thing
comment: Entities owned by the subject

created
type: DatatypeProperty
sub property of: date
domain: Information Resource
range: Literal
scope note: Used to describe the creation date of a bibliographic item

date
type: DatatypeProperty
domain: Information Resource
range: Literal
comment: A point or period of time associated with an event in the lifecycle of the resource.

issued
type: DatatypeProperty
sub property of: date
domain: Information Resource
range: Literal
scope note: Used to describe the issue date of a bibliographic resource

title
type: DatatypeProperty
domain: Information Resource
range: string
comment: A name given to the resource (e.g., book, article, etc).

chapter
type: DatatypeProperty
sub property of: locator
domain: Information Resource
range: Literal
comment: An chapter number

doi
type: DatatypeProperty
sub property of: identifier
domain: Information Resource
range: Literal
comment: A digital object identifier (DOI) is a persistent identifier or handle used to uniquely identify an information resource.

edition
type: DatatypeProperty
domain: Information Resource
range: Literal
comment: The name defining a special edition of a document. Normally its a literal value composed of a version number and words.

identifier
type: DatatypeProperty
domain: Information Resource
range: Literal
comment: A description (often numeric) that locates an item within a containing document or collection.

isbn
type: DatatypeProperty
sub property of: identifier
domain: Information Resource
range: Literal
comment: International Standard Book Number (ISBN) is a 13-digit number that uniquely identifies books and simlar documents

issn
type: DatatypeProperty
sub property of: identifier
domain: Information Resource
range: Literal
comment: An ISSN is an 8-digit code used to identify newspapers, journals, magazines and periodicals of all kinds and on all media–print and electronic.

issue
type: DatatypeProperty
sub property of: locator
domain: Information Resource
range: Literal
comment: An issue number

locator
type: DatatypeProperty
domain: Information Resource
range: Literal
comment: A description (often numeric) that locates an item within a containing document or collection.

page end
type: DatatypeProperty
sub property of: locator
domain: Information Resource
range: Literal
comment: Ending page number within a continuous page range.

page start
type: DatatypeProperty
sub property of: locator
domain: Information Resource
range: Literal
comment: Starting page number within a continuous page range.

pages
type: DatatypeProperty
sub property of: locator
domain: Information Resource
range: Literal
comment: A string of non-contiguous page spans that locate a Document within a Collection. Example: 23-25, 34, 54-56. For continuous page ranges, use the pageStart and pageEnd properties."

section
type: DatatypeProperty
sub property of: locator
domain: Information Resource
range: Literal
comment: A section number

short title
type: DatatypeProperty
domain: Information Resource
range: Literal
comment: The abbreviation of a title.

uri
type: DatatypeProperty
sub property of: identifier
domain: Information Resource
range: Literal
comment: Universal Resource Identifier of a document.

volume
type: DatatypeProperty
sub property of: locator
domain: Information Resource
range: Literal
comment: A volume number

description
type: DatatypeProperty
domain: Person
range: string
comment: An extended description or account of someone's life.

name
type: DatatypeProperty
domain: Place
range: string
comment: The main international name of a feature.

family name
type: DatatypeProperty
equivalent property: given name
domain: Person
range: string
comment: The name used to identify the members of a family (as distinguished from each member's given name)
alternative label: last name

first name
type: DatatypeProperty
equivalent property: given name
domain: Person
range: string
comment: The first name of a person.
alternative label: forename

given name
type: DatatypeProperty
domain: Person
range: string

myersBriggs
type: DatatypeProperty
domain: Person
range: Literal
comment: A Myers Briggs (MBTI) personality classification.

name
type: DatatypeProperty
domain: Agent
range: string
comment: A name for some thing.

nickname
type: DatatypeProperty
domain: Class
  union of: Agent
  union of: Domestic Animal
range: string
comment: A short informal nickname characterising an agent (includes login identifiers, IRC and other chat nicknames).

given name
type: DatatypeProperty
domain: Person
range: string
comment: The given name of some person.
comment: The name used to identify the members of a family (as distinguished from each member's given name)
label: surname
alternative label: cognomen
alternative label: last name

alternate name
type: DatatypeProperty
domain: Thing
range: string
comment: An alias for the item.

award
type: DatatypeProperty
domain: Class
  union of: Award
  union of: Honorary Title
range: string
comment: An award won by or for this item.

description
type: DatatypeProperty
domain: Thing
range: Literal
comment: A statement that represents something in words. It is the act of describing something. The description can include, for instance, the purpose of a thing, the scope, the area of applications of a thing, the history, etc.
comment: An account of the resource.

estimated salary
type: DatatypeProperty
domain: Employment
range: Literal
comment: An estimated salary for a job posting or occupation, based on a variety of variables including, but not limited to industry, job title, and location.

founding date
type: DatatypeProperty
sub property of: event year
domain: Organization
range: gYear
comment: The date that this organization was founded.

honorific prefix
type: DatatypeProperty
domain: Agent
range: string
comment: An honorific prefix preceding a Person's name such as Dr/Mrs/Mr.

honorific suffix
type: DatatypeProperty
domain: Agent
range: string
comment: An honorific suffix following a Person's name such as M.D./PhD/MSCSW.

keywords
type: DatatypeProperty
domain: Thing
range: Literal
comment: Keywords or tags used to describe some item. Multiple textual entries in a keywords list are typically delimited by commas, or by repeating the property.

street address
type: DatatypeProperty
domain: Residence
range: Literal
comment: A collection of information that describes the location of a building, apartment, or other structure

download link
type: DatatypeProperty
domain: Thing
range: anyURI
comment: URL which can be used to download a work.

activity duration
type: DatatypeProperty
domain: Class
  union of: Activity
  union of: Daily Routine
range: Literal
comment: Specifies the duration or length of time associated with an activity.

award year
type: DatatypeProperty
sub property of: event year
domain: Class
  union of: Academic Degree
  union of: Award
range: gYear
comment: The year in which a person received an award or recognition for their achievements.

birth year
type: DatatypeProperty
sub property of: event year
domain: Agent
range: gYear
comment: The year in which a person was born when the full date is not given.

cause of death
type: DatatypeProperty
domain: Person
range: string
comment: Specifies the reason or cause behind an individual's death.

contribution name
type: DatatypeProperty
domain: Contribution
range: Literal
comment: Specifies the name or title of a major contribution made by an individual.

death year
type: DatatypeProperty
sub property of: event year
domain: Agent
range: gYear
comment: The year in which a person died when the full date is not given.

end time
type: DatatypeProperty
domain: Thing
range: Literal
comment: Signifies the time at which a particular activity ended.

endowment name
type: DatatypeProperty
domain: Endowment
range: Literal
comment: The name of endowment made out to a person or an organization.

endowment year
type: DatatypeProperty
sub property of: event year
domain: Endowment
range: gYear
comment: The year when an endowment, donation, or funding was received by an organization.

event year
type: DatatypeProperty
domain: Thing
range: gYear
comment: The year in which a particular event took place.

has epithet
type: DatatypeProperty
domain: Person
range: string
comment: A descriptive text accompanying or occurring in place of the name of a real or fictitious person. It is often used as a nickname, title, or characteristic identifier.
alternative label: known as
alternative label: moniker

has goal
type: DatatypeProperty
domain: Agent
range: string
comment: Denotes the goal or objectives that a person aims to achieve, providing textual description or details about their aspirations, targets, or desired outcomes.

has height
type: DatatypeProperty
domain: Person
range: Literal
comment: Specifies the height of a person in units of length, typically measured in meters (m), centimeters (cm), or feet (ft).

has outcome
type: DatatypeProperty
domain: Conflict
range: Literal
comment: The outcome or result of a conflict.

has weight
type: DatatypeProperty
domain: Person
range: Literal
comment: Specifies the weight of a person in units of mass, typically measured in kilograms (kg) or pounds (lb).

marriage till
type: DatatypeProperty
sub property of: event year
domain: Marriage
range: gYear
comment: The year in which a person's marriage or marital union terminated.

marriage year
type: DatatypeProperty
sub property of: event year
type: FunctionalProperty
domain: Marriage
range: gYear
comment: The year when a person entered into a marriage or a marital union.

mode of transport
type: DatatypeProperty
domain: Travel
range: string
comment: Relates a travel to the means or mode of transportation used during the journey.
scope note: Includes specifying the value By Air, By Ship, By Road, etc.

resided from
type: DatatypeProperty
sub property of: event year
domain: Residence
range: gYear
comment: Specifies the year when a person began residing or living in a particular place or residence.

resided till
type: DatatypeProperty
sub property of: event year
domain: Residence
range: gYear
comment: Specifices the year when a person ceased residing or living in a specific place or residence.

start time
type: DatatypeProperty
domain: Thing
range: Literal
comment: Signifies the time at which a particular activity started.

tenure from
type: DatatypeProperty
sub property of: event year
domain: Work History
range: gYear
comment: The start year of a person's tenure or employment in a particular position or organization.

tenure till
type: DatatypeProperty
sub property of: event year
domain: Work History
range: gYear
comment: The end year of a person's tenure or employment in a particular position or organization.

time of birth
type: DatatypeProperty
domain: Person
range: dateTime
comment: Specifies the time or moment when an individual was born.

time of death
type: DatatypeProperty
domain: Person
range: Literal
comment: Specifies the time or moment when an individual passed away or died.

travel year
type: DatatypeProperty
sub property of: event year
domain: Travel
range: gYear
comment: The year in which a particular travel was undertaken.

encounter date
type: DatatypeProperty
sub property of: event year
domain: Health Record
range: gYear
comment: The date on which a particular health incident was reported.
alternative label: date of encounter

Article
type: Class
subclass of: Document
comment: A written composition in prose, usually nonfiction, on a specific topic, forming an independent part of a book or other publication, as a newspaper or magazine.

Audio Document
type: Class
subclass of: Document
comment: An audio document; aka record.

Audio Visual Document
type: Class
subclass of: Document
comment: An audio-visual document; film, video, and so forth.

Bill
type: Class
subclass of: Legislation
comment: Draft legislation presented for discussion to a legal body.

Book
type: Class
subclass of: Document
comment: A written or printed work of fiction or nonfiction, usually on sheets of paper fastened or bound together within covers.

Chapter
type: Class
subclass of: Document
comment: A chapter of a book.

Collected Document
type: Class
subclass of: Document
comment: A document that simultaneously contains other documents.

Collection
type: Class
subclass of: Information Resource
comment: A collection of Documents or Collections.

Conference
type: Class
subclass of: Event
comment: A meeting for consultation or discussion.

Document
type: Class
equivalent class: Document
subclass of: Information Resource
comment: A document (noun) is a bounded physical representation of body of information designed with the capacity (and usually intent) to communicate. A document may manifest symbolic, diagrammatic or sensory-representational information.

Document Part
type: Class
subclass of: Document
comment: A distinct part of a larger document or collected document.

Edited Book
type: Class
subclass of: Collection
comment: An edited book.

Email
type: Class
subclass of: Personal Communication Document
comment: A written communication addressed to a person or organization and transmitted electronically.

Event
type: Class

Film
type: Class
subclass of: Audio Visual Document
comment: A recording of moving images usually accompained by sound.
alternative label: Cinema
alternative label: Movie

Interview
type: Class
subclass of: Event
comment: A formalized discussion between two or more people.

Journal
type: Class
subclass of: Periodical
comment: A periodical of scholarly journal Articles.

Legal Document
type: Class
subclass of: Document
comment: A legal document; for example, a court decision, a brief, and so forth.

Legislation
type: Class
subclass of: Legal Document
comment: A legal document proposing or enacting a law or a group of laws.

Letter
type: Class
subclass of: Personal Communication Document
comment: A written or printed communication addressed to a person or organization and usually transmitted by mail.

Magazine
type: Class
subclass of: Periodical
comment: A magazine is a publication that is issued periodically, usually bound in a paper cover, and typically contains essays, stories, poems, etc., by many writers, and often photographs and drawings, frequently specializing in a particular subject or area, as hobbies, news, or sports.
comment: A periodical of magazine Articles.

Manuscript
type: Class
subclass of: Document
comment: An unpublished Document, which may also be submitted to a publisher for publication.

Newspaper
type: Class
subclass of: Periodical
comment: A periodical of documents, usually issued daily or weekly, containing current news, editorials, feature articles, and usually advertising.

Patent
type: Class
subclass of: Document
comment: A document describing the exclusive right granted by a government to an inventor to manufacture, use, or sell an invention for a certain number of years.

Performance
type: Class
subclass of: Event
comment: A public performance.

Periodical
type: Class
subclass of: Collection
comment: A group of related documents issued at regular intervals.

Personal Communication
type: Class
subclass of: Event
comment: A communication between an agent and one or more specific recipients.

Personal Communication Document
type: Class
subclass of: Document
comment: A personal communication manifested in some document.

Proceedings
type: Class
subclass of: Book
comment: A compilation of documents published from an event, such as a conference.

Quote
type: Class
comment: An excerpted collection of words.

Reference Source
type: Class
subclass of: Document
comment: A document that presents authoritative reference information, such as a dictionary or encylopedia.

Report
type: Class
subclass of: Document
comment: A document describing an account or statement describing in detail an event, situation, or the like, usually as the result of observation, inquiry, etc..

Series
type: Class
subclass of: Collection
comment: A loose, thematic, collection of Documents, often Books.

Thesis
type: Class
subclass of: Document
comment: A document created to summarize research findings associated with the completion of an academic degree.

Webpage
type: Class
subclass of: Document
comment: A web page is an online document available (at least initially) on the world wide web. A web page is written first and foremost to appear on the web, as distinct from other online resources such as books, manuscripts or audio documents which use the web primarily as a distribution mechanism alongside other more traditional methods such as print.

Website
type: Class
subclass of: Collection
comment: A group of Webpages accessible on the Web.

Employment
type: Class
subclass of: Work History
subclass of: Restriction
  some values from: Title
  on property: job title
subclass of: Restriction
  some values from: Organization
  on property: employed at
comment: The record of a person entering an occupational relationship with an employer.

Marriage
type: Class
subclass of: Event
subclass of: Restriction
  some values from: Person
  on property: has partner
subclass of: Restriction
  some values from: gYear
  on property: event year
comment: The event of creating uniting the participants into a new family unit, sometimes accompanied by a formal wedding ceremony. This is intended to cover a broad range of marriages including those given formal legal standing, common-law, or by convention. It is not restricted to marriages of two people of the opposite gender, but also includes polygamous and same-sex unions.

Education
type: Class
comment: The act or process for the transmission of knowledge and skills.

Work History
type: Class
comment: A detailed history of a person's employment in various forms.
alternative label: Employment history
alternative label: Work Experience

Academic Degree
type: Class
subclass of: Education
comment: An academic degree at any level, both as reported by individuals for employment and as offered by academic degree programs.

Association
type: Class
subclass of: Organization
comment: A club of of people united by a common interest or goal.

Award
type: Class
comment: A prize or other mark of recognition given in honour of an achievement.
alternative label: Honor

College
type: Class
subclass of: Education Organization
comment: An educational institution, varying in level from country to country.

Committee
type: Class
subclass of: Organization
comment: A committee or commission is a body of one or more persons subordinate to a deliberative assembly.

Foundation
type: Class
subclass of: Charitable Organization
comment: A type of nonprofit organization.

Museum
type: Class
subclass of: Memory Institution
comment: An institution that holds artifacts and other objects of scientific, artistic, cultural, historical, or other importance

Publisher
type: Class
subclass of: Organization
comment: An organization whose business is the publishing of books, periodicals, engravings, computer software, etc.

School
type: Class
subclass of: Education Organization
comment: An institution where the education of students by teachers takes place especially to persons under college age

University
type: Class
subclass of: Education Organization
comment: An institution of higher learning providing facilities for teaching and research and authorized to grant academic degrees

Organization
type: Class
equivalent class: Organization
subclass of: Agent
comment: Represents a collection of people organized together into a community or other social, commercial or political structure. The group has some common purpose or reason for existence which goes beyond the set of people belonging to it and can act as an Agent. Organizations are often decomposable into hierarchical structures.

Organizational Unit
type: Class
subclass of: Organization
comment: An Organization such as a department or support unit which is part of some larger Organization and only has full recognition within the context of that Organization. In particular the unit would not be regarded as a legal entity in its own right.
alternative label: Department

Agent
type: Class
comment: An agent (eg. person, group, software or physical artifact)

Document
type: Class
subclass of: Information Resource
comment: A document.

Group
type: Class
subclass of: Agent
comment: A class of Agents.

Image
type: Class
subclass of: Document
comment: An image.

Organization
type: Class
subclass of: Agent
comment: An organization.
comment: The foaf:Organization class represents a kind of foaf:Agent corresponding to social instititutions such as companies, societies etc.

Person
type: Class
subclass of: Agent
subclass of: Restriction
  some values from: Gender Type
  on property: gender
subclass of: Restriction
  some values from: Man
  on property: has father
subclass of: Restriction
  some values from: Woman
  on property: has mother
subclass of: Restriction
  on class: Gender Type
  qualified cardinality: 1
  on property: gender
subclass of: Restriction
  on class: Person
  qualified cardinality: 2
  on property: has parent
comment: A person

Administrative Area
type: Class
subclass of: Place
comment: A geographical region, typically under the jurisdiction of a particular government.

City
type: Class
subclass of: Place
comment: A city or town.

Continent
type: Class
subclass of: Place
comment: One of the continents (for example, Europe or Africa).

Country
type: Class
subclass of: Place
comment: A country.

Creative Work
type: Class
equivalent class: Information Resource
comment: The most generic kind of creative work, including books, movies, photographs, software programs, etc.

Education Organization
type: Class
subclass of: Organization
subclass of: Class
  union of: College
  union of: School
  union of: University
  union of: Library
comment: An educational organization.

Gender Type
type: Class
comment: An enumeration of genders.
see also: The identifier (http://id.who.int/icd/entity/1069182691) from International Classification of Diseases better defines our use of this entity.

Government Organization
type: Class
subclass of: Organization
comment: A governmental organization or agency.

Language
type: Class
comment: Natural languages such as Spanish, Tamil, Hindi, English, etc.

Medical Condition
type: Class
comment: Any condition of the human body that affects the normal functioning of a person, whether physically or mentally. Includes diseases, injuries, disabilities, disorders, syndromes, etc.

Medical Organization
type: Class
subclass of: Organization
comment: A medical organization (physical or not), such as hospital, institution or clinic.

Place
type: Class
comment: Entities that have a somewhat fixed, physical extension.

State
type: Class
subclass of: Place
comment: A state or province of a country.

Tourist Attraction
type: Class
subclass of: Place
comment: A tourist attraction. In principle any Thing can be a Tourist Attraction, from a Mountain and Landmarks Or HistoricalBuildings to a Local Business.

Academic discipline
type: Class
comment: A branch of knowledge
comment: Academic field of study or profession
alternative label: Academic field
alternative label: Subject area

Information Resource
type: Class
comment: An Information Resource

Manual
type: Class
subclass of: Document
comment: A small reference book, especially one giving instructions.

Accessory
type: Class
subclass of: Clothing Type
comment: An adjunct cloth item carried or worn that contributes to the wearer's outfit.

Action
type: Class
comment: A thing done over a period of time or in stages, usually with some purpose.
alternative label: Act

Activity
type: Class
comment: A series of actions done by an agent.

Adjuvant Therapy
type: Class
subclass of: Treatment Procedure
comment: Medical treatment in addition to a primary treatment to maximise effectiveness

Alcoholic Drink
type: Class
subclass of: Beverage
comment: A type of drink that contains some quantity of ethanol usually obtained through fermentation.

Alternative Medicine
type: Class
subclass of: Treatment Procedure
comment: Any form of non-scientific healing
alternative label: Complementary Medicine

Animal Origin Food
type: Class
subclass of: Edible Food
comment: Animal origin food refers to any type of food that is derived from animals.

Archive
type: Class
subclass of: Memory Institution
comment: An agency or institution responsible for the preservation and communication of records selected for permanent preservation

Armed Force
type: Class
subclass of: Occupation
comment: It includes all jobs held by members of the armed forces, which is a constituent element of a country's combined military services.

Artifact
type: Class
subclass of: Agent
comment: An object made or shaped by some agent for some use.

Bachelor's degree
type: Class
subclass of: Academic Degree
comment: Undergraduate academic degree lasting from three to seven years.
alternative label: Baccalaureate degree

Body Garment
type: Class
subclass of: Clothing Type
comment: A clothing item, often consisting of various parts, covering the entire length of the body, usually worn in special occasions.

Body Physique
type: Class
subclass of: Physical Trait
comment: The shape and size of a human body.
alternative label: Body Type

Bottomwear
type: Class
subclass of: Clothing Type
comment: Items of clothing to cover the lower part of the body.

Breakfast
type: Class
subclass of: Meal
comment: Breakfast is the first meal of the day usually eaten in the morning.

Brunch
type: Class
subclass of: Meal
comment: A meal usually taken late in the morning that combines a late breakfast and an early lunch.

Causal Type
type: Class
comment: Underlying causality for different events and actions.
alternative label: Causality
alternative label: Cause

Cause of Conflict
type: Class
subclass of: Causal Type
comment: A situation or development leading to conflict.

Charitable Organization
type: Class
subclass of: Organization
comment: A non-profit organization with charitable purpose.
alternative label: Non-Profit Charitable Organization

Clothing Material
type: Class
comment: The material or fabric used in making clothes.
alternative label: Fabric

Clothing Type
type: Class
comment: Any item used to cover the body for protection or decoration.
alternative label: Clothing Item
alternative label: Type of Cloth

Commercial organization
type: Class
subclass of: Organization
comment: Any business or company that sells goods or services for the purpose of making a profit in contrast to a non-profit organization.
alternative label: Commercial Enterprise

Conflict
type: Class
subclass of: Action
comment: A competitive or opposing action of incompatibles: an antagonistic state or action of divergent ideas, interests, or persons.

Contribution
type: Class
subclass of: Action
comment: The act of contributing that helps in bringing about a result or helping something to advance.

Creative Activity
type: Class
subclass of: Activity
comment: Activities primarily promoting the use of mental faculties.
alternative label: Intellectual Activity

Daily Living Activity
type: Class
subclass of: Activity
comment: Activities of daily living (ADLs) are essential and routine tasks that most young, healthy individuals can perform without assistance.
alternative label: ADL
alternative label: Activities of daily living

Daily Routine
type: Class
subclass of: Habit
comment: Routine processes in people's daily and weekly cycle.

Decorative Mark
type: Class
subclass of: Physical Trait
comment: A decorative mark worn for symbolic purposes.

Dinner
type: Class
subclass of: Meal
comment: The main meal of the day, taken either around midday or in the evening.

Doctoral Degree
type: Class
subclass of: Academic Degree
comment: It is a postgraduate academic degree awarded by universities or educational institutions in recognition of a meritorius work.
alternative label: Doctorate

Dressing Habit
type: Class
subclass of: Habit
comment: Style of looking, reached through the choice of clothing, as well as accessories or make-up.
alternative label: Dress Style
alternative label: Fashion Style

Beverage
type: Class
subclass of: Food Item
comment: A type of liquid food of smooth consistency.
label: Drinkable Food

Edible Food
type: Class
subclass of: Food Item
comment: Any food that is fit to be consummed by humans.

Educator
type: Class
subclass of: Occupation
comment: An educator teaches the theory and practice of one or more academic disciplines at different educational levels, conducts research, etc.

Endowment
type: Class
subclass of: Action
comment: A sum of donations for the ongoing support of a not-for-profit institution

Engineering
type: Class
subclass of: Occupation
comment: Professionals in this sector conduct research and improve or develop concepts, theories and operational methods, or apply existing knowledge in such fields as architecture and engineering, as well as in the field of technological and economic efficiency of production processes.

Ethnic Group
type: Class
subclass of: Group
comment: A socially defined category of people who identify with each other.

Evening Snack
type: Class
subclass of: Meal
comment: A small meal consumed in the late afternoon or early evening, typically between lunch and dinner.
alternative label: Light Supper

Executive
type: Class
subclass of: Occupation
comment: Executives review policies, and plan, direct, coordinate and evaluate the overall activities of enterprises, governments and other organizations with the support of other managers.

Eye Color
type: Class
subclass of: Physical Trait
comment: A polygenic phenotypic trait.
comment: The pigmentation of the eye's iris.
alternative label: Human Eye Color

Facial Feature
type: Class
subclass of: Physical Trait
comment: A distinguishing feature of a face.

Family
type: Class
subclass of: Group
comment: A group of people affiliated by consanguinity, law, affinity, or co-residence

Financial
type: Class
subclass of: Occupation
label: Occupation in this sector plan, direct, and coordinate the branches of institutions that provide financial and insurance services, such as banks, building societies, credit unions and insurance companies. They provide advice and assistance to clients on financial and insurance matters.

Food
type: Class
comment: A group of materials of either plant, animal or artificial origin containing essential body nutrients that can be ingested by an organism to produce energy, stimulate growth, and maintain life. (NCI)
comment: A group of substances which are consumed by humans and animals. (NCI)

Food Habit
type: Class
subclass of: Habit
comment: Food-related behavior

Food Item
type: Class
equivalent class: Class
  union of: Beverage
  union of: Edible Food
subclass of: Food
comment: Any substance consumed to provide nutritional support for the body.

Footwear
type: Class
subclass of: Clothing Type
comment: Garments worn on feet.

Gallery
type: Class
subclass of: Memory Institution
comment: A place where art is exhibited and sometimes also sold
alternative label: Art Gallery

Habit
type: Class
comment: Routine of behavior that is repeated regularly and tends to occur subconsciously.

Hair Style
type: Class
subclass of: Physical Trait
comment: It refers to the specific way in which an individual's hair is cut, arranged, or styled.

Healthcare
type: Class
subclass of: Occupation
comment: An occupation in the healthcare sector studies, diagnoses, treats, and prevents illness, disease, injury and other physical and mental impairments in humans. It also includes planning, supervision, and the implementation of care and treatment plans by other health care providers, and conduct medical education and research activities

Honorary degree
type: Class
subclass of: Education
comment: A degree awarded to honour an individual, waiving requirements.
alternative label: Honoris Causa

Honorary Title
type: Class
subclass of: Title
comment: Title bestowed upon individuals or organizations as an award in recognition of their merits

Honorary Work
type: Class
subclass of: Work History
comment: It referes to volunteer work or services performed without payment or compensation.

Hospitality
type: Class
subclass of: Occupation
comment: This profession provides personalized services like housekeeping, travel arrangements, companionship, food and catering, etc.

Identification Mark
type: Class
subclass of: Physical Trait
comment: Any mark on the body by birth, birthmark or any indelible scar which helps in identifying a person easily.
alternative label: Visibly Distinguishing Mark

Injury
type: Class
subclass of: Medical Condition
comment: An injury refers to physical harm or damage to the body caused by an external force, accident, trauma, or some form of harmful exposure.

International Organization
type: Class
subclass of: Organization
comment: Organization established by treaty between governments

Legal
type: Class
subclass of: Occupation
comment: Legal professionals conduct research on legal problems, draft laws and regulations, advise clients on legal aspects of problems, and plead cases or conduct prosecutions in courts of justice, or preside over judicial proceedings and pronounce judgement in courts of justice.

Library
type: Class
subclass of: Memory Institution
comment: An institution charged with the care of a collection of literary, musical, artistic, or reference materials, such as books, manuscripts, recordings, or films
comment: An institution in which literary, musical, artistic, or reference materials (such as books, manuscripts, recordings, or films) are kept for use but not for sale.

Locality
type: Class
subclass of: Place
comment: A particular area in a country, state, or city.
alternative label: Neighbourhood

Lunch
type: Class
subclass of: Meal
comment: A meal eaten around the middle of the day, usually second.

Man
type: Class
equivalent class: Class
  intersection of: Person
  intersection of: Restriction
    has value: Male
    on property: gender
subclass of: Person
disjoint with: Woman
comment: A person of male sex.

Manager
type: Class
subclass of: Occupation
comment: A person who manages organization, household, property, etc. For example, Principal, Homemaker, Landowner.

Master's Degree
type: Class
subclass of: Academic Degree
comment: It is a postgraduate academic degree awarded by universities after the completion of the undergraduate degree.
alternative label: Postgraduate academic degree

Matriculation Degree
type: Class
subclass of: Academic Degree
comment: Degree awarded for completing high school or before entering university.

Meal
type: Class
subclass of: Food
comment: Eating that takes place at a specific time

Memory Institution
type: Class
subclass of: Organization
comment: A memory institution is an organization maintaining a repository of public knowledge, a generic term used about institutions such as libraries, archives, museums, etc.

Mixed Origin Food
type: Class
subclass of: Edible Food
comment: Mixed origin food refers to any type of food that is derived from both plants and animals.

Non Alcoholic Drink
type: Class
subclass of: Beverage
comment: Any form of liquid food not containing alcohol.

Occupational Activity
type: Class
subclass of: Activity
comment: Activities primarily undertaked to earn one's living.

Outerwear
type: Class
subclass of: Clothing Type
comment: Outerwear is clothing designed to be worn outside other garments.

Participant
type: Class
comment: Person or Object that takes part in an event or process

Personality Trait
type: Class
subclass of: Trait
comment: Particular psychological characteristic of an individual, usually manifested through activities or situations.

Pharmacotherapy
type: Class
subclass of: Treatment Procedure
comment: Treatment of health conditions by using pharmaceutical products (drugs) as medication.
alternative label: Drug Therapy

Physical Activity
type: Class
subclass of: Activity
comment: Activities that promote one's sense of well being through bodily movement.

Physical Appearance
type: Class
subclass of: Trait
comment: Physical Appearance is the outward phenotype or look of human beings.
comment: Physical appearance means the outward appearance of any person, irrespective of sex, with regard to hair style, beards, weight, height, facial features, or other aspects of appearance.

Physical Trait
type: Class
subclass of: Trait
comment: Any outward characteristic or feature which forms a part of a person's physical appearance.
alternative label: Looks

Plant Origin Food
type: Class
subclass of: Edible Food
comment: Plant origin food refers to any type of food that is derived from plants.

Professional Affiliation
type: Class
subclass of: Work History
comment: A type pf formal association with a particular professional group, society, association, or institution with ot without monetary benefits.

Professional Degree
type: Class
subclass of: Education
comment: A degree that prepares someone to work in a particular profession.

Professional Title
type: Class
subclass of: Title
comment: Indicates a specific title or designation associated with a profession or job, indicating a person's professional position, role, or occupational title.
alternative label: Occupational Title
alternative label: Job Title
alternative label: Professional Designation

Leisure Activity
type: Class
subclass of: Activity
comment: Activities undertaken during leisure, for amusement, enjoyment, and therapeutic purposes.
label: Recreational Activity

Religion
type: Class
comment: A personal set or institutionalized system of religious attitudes, beliefs, and practices.
comment: A social-cultural system.

Religious Activity
type: Class
subclass of: Activity
comment: A series of actions undertaken in conformity with one's relgious belief.

Residence
type: Class
subclass of: Place
comment: A place where a person lives alone or with a family.
alternative label: Dwelling

Sexual Orientation
type: Class
subclass of: Habit
comment: Enduring pattern of sexual attraction

Skin Color
type: Class
subclass of: Physical Trait
comment: It is the skin color of an individual as a result of genetics.

Social-Cultural
type: Class
subclass of: Occupation
comment: Social and Cultural Professionals are responsible for storing and dissemination of knowledge and information, especially realted to culture and memory. Examples of this occupation are librarian, historian, journalist, etc.
alternative label: Social and Cultural Professionals

Special Dish
type: Class
subclass of: Meal
comment: A meal that is a unique food item in culinary contexts, either due to the occasions or due to its personal context.
alternative label: Special Meal

Spiritual Guidance
type: Class
subclass of: Occupation
comment: Spiritual Guides preach and propagate the teachings of a particular religion and endeavour to improve well-being through the power of faith and spiritual advice. E.g.: Healers, Monks, etc.
alternative label: Religious Associate Professionals

Support Worker
type: Class
subclass of: Occupation
comment: They usually perform supportive tasks, ranging various clerical activities, such as money-handling operations, travel arrangements, requests for information, and appointments. E.g.: Private Secretary, Office Clerk.

Technician
type: Class
subclass of: Occupation
comment: Technicians and associate professionals perform technical and related tasks connected with research and the application of scientific or artistic concepts and operational methods, and government or business regulations. It also includes undertaking and carrying out technical work connected with research and the application of concepts and operational methods in the fields of physical sciences including engineering and technology. E.g.: Printing Technologist, Electrical Technician, etc.

Title
type: Class
comment: Qualified name, rank, or other indication of a class or role given to or inherited by a person, often affixed to a person's name

Topwear
type: Class
subclass of: Clothing Type
comment: Items of clothing to cover the upper part of the body.

Trait
type: Class
comment: A distinguishing characteristic or quality, especially of one's personal nature.

Travel
type: Class
subclass of: Action
comment: The act of journey or movement of people between geographical locations.
alternative label: Journey

Travel Purpose
type: Class
subclass of: Causal Type
comment: The specific reason or intent behind an individual's visit to other places.
alternative label: Reason for Travel

Undergarment
type: Class
subclass of: Clothing Type
comment: Items of clothing worn beneath outer clothes, usually in direct contact with the skin.
alternative label: Underwear

Village
type: Class
subclass of: Place
comment: A clustered human settlement smaller than a town.

Woman
type: Class
equivalent class: Class
  intersection of: Person
  intersection of: Restriction
    has value: Female
    on property: gender
subclass of: Person
comment: A person of female sex.

Anatomical Region
type: Class
comment: Anatomical areas of the body. (MSH)
alternative label: Body site or region

Dental Procedure
type: Class
subclass of: Treatment Procedure
comment: Any of the dental diagnostic, preventive, and restorative services provided to meet the needs of a patient.

Disease
type: Class
subclass of: Medical Condition
comment: Any abnormal condition of the body or mind that causes discomfort, dysfunction, or distress to the person affected or those in contact with the person. The term is often used broadly to include injuries, disabilities, syndromes, symptoms, deviant behaviors, and atypical variations of structure and function. (NCI)

Health Record
type: Class
comment: Health record of an individual patient

Surgery
type: Class
subclass of: Treatment Procedure
comment: Intentional, structural alteration of the human body by mechanical, thermal, light-based, electromagnetic, or chemical means, and/or by the incision or destruction of tissues using instruments to cut, burn, vaporise, freeze, suture, probe, or manipulate by closed reductions.

Symptom
type: Class
comment: An indication that a person has a condition or disease. Some examples of symptoms are headache, fever, fatigue, nausea, vomiting, and pain. (NCI)
comment: Subjective evidence of disease perceived by the patient. (NCI)

Treatment Procedure
type: Class
comment: Extent of understanding conveyed about a procedure required as part of a treatment regimen.

Pet
type: Class
subclass of: Domestic Animal
comment: An animal kept for companionship and a person's enjoyment.

Domestic Animal
type: Class
subclass of: Agent
comment: An animal that has been tamed and that lives with humans.

Occupation
type: Class
comment: A profession, may involve prolonged training and/or a formal qualification.
comment: The classification of the Occupation entity is based on the ISCO-08 (International Standard Classification of Occupations). The document can be found at: https://ilostat.ilo.org/resources/concepts-and-definitions/classification-occupation/
comment: The principal business of one's life, especially as a means of earning a living.

Rupture of gastrocnemius tendon
type: NamedIndividual
type: Injury
alternative label: Torn Gastrocnemius

Bronchitis
type: NamedIndividual
type: Disease

Acute Respiratory Distress
type: NamedIndividual
type: Symptom

Solar erythema
type: NamedIndividual
type: Injury
alternative label: Solar dermatitis
alternative label: Sunburn

Malocclusion of Teeth
type: NamedIndividual
type: Disease
alternative label: Malocclusion

Oxygen Therapy
type: NamedIndividual
type: Adjuvant Therapy

Local infection of wound
type: NamedIndividual
type: Injury
alternative label: Infected Wound
alternative label: Septic Wound

Denture
type: NamedIndividual
type: Dental Procedure
alternative label: Dentures

Bleeding Gums
type: NamedIndividual
type: Symptom

Abdul Rahman Kamaruddin
type: NamedIndividual
type: Man
apprentice to: Shiyali Ramamrita Ranganathan Ayyar
colleague of: Triplicaine Ranganathan Yogeshwar
friend of: Shiyali Ramamrita Ranganathan Ayyar
friend of: Vangal Lakshmana Sarada
friend of: Triplicaine Ranganathan Yogeshwar
has occupation: Librarian
follows religion: Islam
has spouse: Afroze Fatima
first name: Abdul
given name: Kamaruddin

Afroze Fatima
type: NamedIndividual
type: Woman
apprentice to: Shiyali Ramamrita Ranganathan Ayyar
colleague of: Triplicaine Ranganathan Yogeshwar
friend of: Shiyali Ramamrita Ranganathan Ayyar
friend of: Vangal Lakshmana Sarada
friend of: Triplicaine Ranganathan Yogeshwar
has occupation: Librarian
follows religion: Islam
has husband: Abdul Rahman Kamaruddin
first name: Afroze
given name: Fatima

Allahabad
type: NamedIndividual
type: City
contained in place: India

American Library Association
type: NamedIndividual
type: Association
contained in place: USA
alternate name: ALA

Introduction to the study of character formation
type: NamedIndividual
type: Article
creator: Shiyali Ramamrita Ranganathan Ayyar
published in: Educational Review
created: 1916
pages: 488
volume: 22

Mathematical Questions
type: NamedIndividual
type: Article
creator: Shiyali Ramamrita Ranganathan Ayyar
published in: Journal of the Indian Mathematical Society
created: 1916
pages: Q. 763, 764
volume: 9

Mathematical Solutions
type: NamedIndividual
type: Article
creator: Shiyali Ramamrita Ranganathan Ayyar
published in: Journal of the Indian Mathematical Society
created: 1916
pages: Q. 716
volume: 8

Numbers
type: NamedIndividual
type: Article
creator: Shiyali Ramamrita Ranganathan Ayyar
published in: Educational Review
created: 1916
volume: 22

Review of Indian Mathematics
type: NamedIndividual
type: Article
creator: Shiyali Ramamrita Ranganathan Ayyar
published in: Journal of the Indian Mathematical Society
created: 1916
pages: 6,8
volume: 9

Homographic sequence
type: NamedIndividual
type: Article
creator: Shiyali Ramamrita Ranganathan Ayyar
published in: Journal of the Indian Mathematical Society
created: 1917
pages: 109-13
volume: 10

Mathematical Solutions
type: NamedIndividual
type: Article
creator: Shiyali Ramamrita Ranganathan Ayyar
published in: Journal of the Indian Mathematical Society
created: 1920
pages: Q.1090
volume: 12

Herpholphode Theorem
type: NamedIndividual
type: Article
creator: Shiyali Ramamrita Ranganathan Ayyar
published in: Journal of the Indian Mathematical Society
created: 1921
pages: 87
volume: 13

Memorandum on Examination
type: NamedIndividual
type: Article
contributor: P. Venkatesvara Seshu Aiyar
creator: Shiyali Ramamrita Ranganathan Ayyar
published in: Educational Review
created: 1922
pages: 164-78
volume: 28

Statistical Study of Some Examination Marks
type: NamedIndividual
type: Article
contributor: P. Venkatesvara Seshu Aiyar
creator: Shiyali Ramamrita Ranganathan Ayyar
published in: Journal of the Indian Mathematical Society
created: 1923
pages: 141-45
volume: 15

Government contribution in the new provident fund scheme
type: NamedIndividual
type: Article
creator: Shiyali Ramamrita Ranganathan Ayyar
published in: Educational Review
created: 1923
pages: 411, 651-53
volume: 29

Rural Library Service and National Education
type: NamedIndividual
type: Article
creator: Shiyali Ramamrita Ranganathan Ayyar
published in: South Indian Teacher
created: 1928
pages: 29-35
volume: 1

A Typical Municipal Library of the West
type: NamedIndividual
type: Article
creator: Shiyali Ramamrita Ranganathan Ayyar
published in: The Library Movement: A Collection of Essays by Diverse Hands
created: 1929
pages: 143-46

An Indian library of the eleventh century
type: NamedIndividual
type: Article
creator: Shiyali Ramamrita Ranganathan Ayyar
published in: South Indian Teacher
created: 1929
pages: 261-62
volume: 2

Growth of educational endowments in America
type: NamedIndividual
type: Article
creator: Shiyali Ramamrita Ranganathan Ayyar
published in: Educational Review
created: 1929
pages: 589-91
volume: 35

Library in Modern Life
type: NamedIndividual
type: Article
creator: Shiyali Ramamrita Ranganathan Ayyar
published in: South Indian Teacher
created: 1929
pages: 409-16
volume: 2

Rural Library Service in the West
type: NamedIndividual
type: Article
creator: Shiyali Ramamrita Ranganathan Ayyar
published in: The Library Movement: A Collection of Essays by Diverse Hands
created: 1929
pages: 122-24

Library's part in Education
type: NamedIndividual
type: Article
creator: Shiyali Ramamrita Ranganathan Ayyar
published in: The Madras Mail
created: 20 November 1930
pages: 12, col. 1-4
description: Lecture at Kellet Hall, Triplicane

Madras Library Association
type: NamedIndividual
type: Article
creator: Shiyali Ramamrita Ranganathan Ayyar
published in: South Indian Teacher
created: 1930
pages: 102-5
volume: 3

Scholarship and Library Staff
type: NamedIndividual
type: Article
creator: Shiyali Ramamrita Ranganathan Ayyar
published in: Educational Review
created: 1930
pages: 547-48
volume: 36

The Work of the Madras Library Association
type: NamedIndividual
type: Article
creator: Shiyali Ramamrita Ranganathan Ayyar
published in: South Indian Teacher
created: 1930
pages: 315

Books for All
type: NamedIndividual
type: Article
creator: Shiyali Ramamrita Ranganathan Ayyar
published in: Scholar
created: 1931
pages: 550-52

Extracts from the Model Public Library Act as amended by the Conference
type: NamedIndividual
type: Article
creator: Shiyali Ramamrita Ranganathan Ayyar
published in: Report of the All Asia Educational Conference
created: 1931
pages: 647-54

Hospital Library Service
type: NamedIndividual
type: Article
creator: Shiyali Ramamrita Ranganathan Ayyar
published in: The Madras Mail
created: 16 September 1932
pages: 10, col. 7

Library Mechanism of Local Bodies; Plea for Committee System
type: NamedIndividual
type: Article
creator: Shiyali Ramamrita Ranganathan Ayyar
published in: The Hindu
created: 17 October 1931
pages: 18, col. 5-7

Library of Local Bodies - Need for Quality Staff
type: NamedIndividual
type: Article
creator: Shiyali Ramamrita Ranganathan Ayyar
published in: The Hindu
created: 1 December 1931
pages: 8, col. 4

Mofussil Residents and City Libraries
type: NamedIndividual
type: Article
creator: Shiyali Ramamrita Ranganathan Ayyar
published in: The Hindu
created: 17 October 1931

The Library Obligations of the State
type: NamedIndividual
type: Article
creator: Shiyali Ramamrita Ranganathan Ayyar
published in: Modern Librarian
created: 1931
pages: 7-10
volume: 2

Library Facilities for Mofussil Readers: What Madras Can Offer
type: NamedIndividual
type: Article
creator: Shiyali Ramamrita Ranganathan Ayyar
published in: The Madras Mail
created: 20 September 1932
pages: 10, col. 4

Library Movement and Democracy
type: NamedIndividual
type: Article
creator: Shiyali Ramamrita Ranganathan Ayyar
created: 1932
pages: 36-41

Library Movement in the West
type: NamedIndividual
type: Article
creator: Shiyali Ramamrita Ranganathan Ayyar
published in: The Hindu
created: 28 November 1932
description: Address at the Nellore Municipal Council on 25 November 1932

Madras University Library
type: NamedIndividual
type: Article
creator: Shiyali Ramamrita Ranganathan Ayyar
published in: Modern Librarian
created: 1932
pages: 157-59
volume: 2

Melvil Dewey, the Father of Modern Librarianship
type: NamedIndividual
type: Article
creator: Shiyali Ramamrita Ranganathan Ayyar
published in: Modern Librarian
created: 1932
pages: 129-30
volume: 2

National Central Library; Development of Information Bureau
type: NamedIndividual
type: Article
creator: Shiyali Ramamrita Ranganathan Ayyar
published in: The Hindu
created: 4 October 1932
pages: 9, col. 6
description: Musings on Library Legislation

National Central Library
type: NamedIndividual
type: Article
creator: Shiyali Ramamrita Ranganathan Ayyar
published in: The Madras Mail
created: 31 August 1932
pages: 12, col. 4
description: Musings on Library Legislation

Asia
type: NamedIndividual
type: Continent
contains country: India
name: Asia

Asia Publishing House
type: NamedIndividual
type: Publisher
type: Organization

Award01
type: NamedIndividual
type: Award
awarded to: Shiyali Ramamrita Ranganathan Ayyar
conferred by: Government of India
honor title: Rao Sahib
award year: 1935

Award02
type: NamedIndividual
type: Award
awarded to: Shiyali Ramamrita Ranganathan Ayyar
conferred by: Government of India
honor title: NationalResearchProfessor
description: A sum of Rs. 1723 per month for research activities.
award year: 1965

Award03
type: NamedIndividual
type: Award
awarded to: Shiyali Ramamrita Ranganathan Ayyar
conferred by: Government of India
honor title: PadmaShri
award year: 1957

Award04
type: NamedIndividual
type: Award
awarded to: Shiyali Ramamrita Ranganathan Ayyar
conferred by: American Library Association
honor title: MargaretMannCitation
award year: 1970

Award05
type: NamedIndividual
type: Award
awarded to: Shiyali Ramamrita Ranganathan Ayyar
conferred by: Mark Twain Society
honor title: GrandKnightOfPeace
award year: 1971

Award06
type: NamedIndividual
type: Award
awarded to: Shiyali Ramamrita Ranganathan Ayyar
conferred by: Bibliographical Society of the University of Virginia
honor title: HonoraryFellow
award year: 1951

Award07
type: NamedIndividual
type: Award
awarded to: Shiyali Ramamrita Ranganathan Ayyar
conferred by: International Federation for Information and Documentation
honor title: HonoraryFellow
award year: 1957

Award08
type: NamedIndividual
type: Award
awarded to: Shiyali Ramamrita Ranganathan Ayyar
conferred by: Indian Standards Institution
honor title: HonoraryFellow
award year: 1967

Award09
type: NamedIndividual
type: Award
awarded to: Shiyali Ramamrita Ranganathan Ayyar
conferred by: Library Association of the United Kingdom
honor title: HonoraryVicePresident
award year: 1957

Award10
type: NamedIndividual
type: Award
awarded to: Shiyali Ramamrita Ranganathan Ayyar
conferred by: Indian Association of Special Libraries and Information Centres
honor title: HonoraryMember
award year: 1956

Award11
type: NamedIndividual
type: Award
awarded to: Shiyali Ramamrita Ranganathan Ayyar
conferred by: Delhi Library Association
honor title: HonoraryPatron
award year: 1954

BA SRR
type: NamedIndividual
type: Bachelor's degree
degree awarded by: Madras Christian College
degree awarded in: Mathematics
followed by: MA SRR
description: B.A. in Mathematics
award year: 1913

BSc Yogeshwar
type: NamedIndividual
type: Bachelor's degree
degree awarded in: Physics
degree awarded to: Triplicaine Ranganathan Yogeshwar
description: B.Sc Hons. in Physics
award year: 1951

Bangalore
type: NamedIndividual
type: City
death place of: Vangal Lakshmana Sarada
name: Bengaluru
alternate name: Bangalore

Banaras Hindu University
type: NamedIndividual
type: University
contained in place: Varanasi
workplace of: P. N. Kaula
workplace of: Madan Mohan Malaviya
workplace of: Shiyali Ramamrita Ranganathan Ayyar
alternate name: BHU

J. D. Bernal
type: NamedIndividual
type: Man
friend of: Shiyali Ramamrita Ranganathan Ayyar
birth place: Ireland
has occupation: Historian
specialization: Chemistry
specialization: Physics
first name: John
given name: Bernal

Erich Bickel
type: NamedIndividual
type: Man
friend of: Shiyali Ramamrita Ranganathan Ayyar
mentor of: Triplicaine Ranganathan Yogeshwar
has occupation: Professor
specialization: MachineToolEngineering
specialization: MaterialsScience
first name: Erich
given name: Bickel

Bombay
type: NamedIndividual
type: City
contained in place: India
name: Mumbai
alternate name: Bombay

Five Laws of Library Science
type: NamedIndividual
type: Book
creator: Shiyali Ramamrita Ranganathan Ayyar
has version: Five Laws of Library Science (2nd Edition)
publisher: Edward Goldston, Ltd.
publisher: Madras Library Association
inspired by: Manusmriti
place of publication: London
place of publication: Madras
created: 1931
edition: 1st ed.

Colon Classification
type: NamedIndividual
type: Book
creator: Shiyali Ramamrita Ranganathan Ayyar
publisher: Madras Library Association
place of publication: Madras
created: 1933
edition: 1st ed.

Classified Catalogue Code
type: NamedIndividual
type: Book
creator: Shiyali Ramamrita Ranganathan Ayyar
has version: Classified Catalogue Code (2nd ed.)
publisher: Madras Library Association
place of publication: Madras
created: 1934
edition: 1st ed.

Library Administration
type: NamedIndividual
type: Book
creator: Shiyali Ramamrita Ranganathan Ayyar
has version: Library Administration (2nd ed.)
publisher: Madras Library Association
place of publication: Madras
created: 1935
edition: 1st ed.

Prolognomena to Library Classification
type: NamedIndividual
type: Book
creator: Shiyali Ramamrita Ranganathan Ayyar
has version: Prolognomena to Library Classification (2nd ed.)
publisher: Madras Library Association
place of publication: Madras
created: 1937
edition: 1st ed.

Theory of Library Catalogue
type: NamedIndividual
type: Book
creator: Shiyali Ramamrita Ranganathan Ayyar
publisher: Madras Library Association
place of publication: Madras
created: 1938

Reference Service and Bibliography: Theory
type: NamedIndividual
type: Book
creator: Shiyali Ramamrita Ranganathan Ayyar
publisher: Madras Library Association
place of publication: Madras
created: 1940
edition: 1st ed.
description: Volume 1, Foreword by Maurice Gwyer

Reference Service and Bibliography: Bibliography of Reference Books and Bibliographies
type: NamedIndividual
type: Book
creator: Shiyali Ramamrita Ranganathan Ayyar
publisher: Madras Library Association
place of publication: Madras
created: 1941
description: Volume 2

School and College Libraries
type: NamedIndividual
type: Book
creator: Shiyali Ramamrita Ranganathan Ayyar
publisher: Madras Library Association
place of publication: Madras
created: 1942

Education and Library System of the Nation
type: NamedIndividual
type: Book
creator: Shiyali Ramamrita Ranganathan Ayyar
publisher: Mysore Library Association
created: 1971

Library Classification: Fundamentals and Procedure with 1008 Graded Examples and Exercises
type: NamedIndividual
type: Book
creator: Shiyali Ramamrita Ranganathan Ayyar
publisher: Madras Library Association
place of publication: Madras
created: 1944
description: Foreword by A. L. Mudaliar

Post War Reconstruction of Libraries in India, A Scheme
type: NamedIndividual
type: Book
creator: Shiyali Ramamrita Ranganathan Ayyar
publisher: Punjab Library Association
place of publication: Lahore
created: 1944
description: Foreword by A. L. Mudaliar

Elements of Library Classification
type: NamedIndividual
type: Book
creator: Shiyali Ramamrita Ranganathan Ayyar
publisher: N. K. Publishing House
place of publication: Pune
created: 1945
edition: 1st ed.
description: Based on Lectures delivered at the University of Bombay in December 1944

Suggestions for the Organization of Libraries in India
type: NamedIndividual
type: Book
creator: Shiyali Ramamrita Ranganathan Ayyar
publisher: Oxford University Press
place of publication: Madras
created: 1946
edition: 1st ed.

Education for Leisure
type: NamedIndividual
type: Book
creator: Shiyali Ramamrita Ranganathan Ayyar
created: 1946
edition: 1st ed.

Classification of Marathi Literature
type: NamedIndividual
type: Book
creator: Shiyali Ramamrita Ranganathan Ayyar
publisher: N. K. Publishing House
place of publication: Pune
created: 1945

Preface to Library Science
type: NamedIndividual
type: Book
creator: Shiyali Ramamrita Ranganathan Ayyar
publisher: University of Delhi
place of publication: Delhi
created: 1948
description: Foreword by Maurice Gwyer

Library Catalogue: Fundamentals and Procedure
type: NamedIndividual
type: Book
creator: Shiyali Ramamrita Ranganathan Ayyar
publisher: Madras Library Association
place of publication: Madras
created: 1950

Classified Catalogue Code (2nd ed.)
type: NamedIndividual
type: Book
creator: Shiyali Ramamrita Ranganathan Ayyar
has version: Classified Catalogue Code (3rd ed.)
publisher: Madras Library Association
place of publication: Madras
created: 1945
edition: 2nd ed.

Library Tour 1948: Europe and America, Impressions and Reflections.
type: NamedIndividual
type: Book
creator: Shiyali Ramamrita Ranganathan Ayyar
publisher: Indian Library Association
place of publication: Delhi
created: 1950

Classification and Communication
type: NamedIndividual
type: Book
creator: Shiyali Ramamrita Ranganathan Ayyar
publisher: University of Delhi
place of publication: Delhi
created: 1951

Philosophy of Library Classification
type: NamedIndividual
type: Book
creator: Shiyali Ramamrita Ranganathan Ayyar
publisher: Ejnar Munksgaard
place of publication: Copenhagen
created: 1951

Library Manual
type: NamedIndividual
type: Book
creator: Shiyali Ramamrita Ranganathan Ayyar
publisher: Indian Library Association
place of publication: Delhi
created: 1951
edition: 1st ed.

Classified Catalogue Code (3rd ed.)
type: NamedIndividual
type: Book
creator: Shiyali Ramamrita Ranganathan Ayyar
has version: Classified Catalogue Code (4th ed.)
publisher: Madras Library Association
place of publication: Madras
created: 1951
edition: 3rd ed.

Library Book Selection
type: NamedIndividual
type: Book
creator: Shiyali Ramamrita Ranganathan Ayyar
publisher: Indian Library Association
place of publication: Delhi
created: 1952
edition: 1st ed.

Five Laws of Library Science (2nd Edition)
type: NamedIndividual
type: Book
creator: Shiyali Ramamrita Ranganathan Ayyar
publisher: Madras Library Association
place of publication: Madras
created: 1957
edition: 2nd ed.
description: Introduction by Wlliam Charles Berwick Sayers

Prolognomena to Library Classification (2nd ed.)
type: NamedIndividual
type: Book
creator: Shiyali Ramamrita Ranganathan Ayyar
has version: Prolognomena to Library Classification (3rd ed.)
publisher: Library Association of the United Kingdom
place of publication: London
created: 1957
edition: 2nd ed.
description: Foreword by William Charles Berwick Sayers

Prolognomena to Library Classification (3rd ed.)
type: NamedIndividual
type: Book
contributor: Malur Aji Gopinath
creator: Shiyali Ramamrita Ranganathan Ayyar
publisher: Asia Publishing House
place of publication: Bombay
created: 1967
edition: 3rd ed.

Library Administration (2nd ed.)
type: NamedIndividual
type: Book
creator: Shiyali Ramamrita Ranganathan Ayyar
publisher: Asia Publishing House
place of publication: Bombay
created: 1959
edition: 2nd ed.

Education for Leisure (4th ed.)
type: NamedIndividual
type: Book
creator: Shiyali Ramamrita Ranganathan Ayyar
publisher: Asia Publishing House
place of publication: Bombay
created: 1961
edition: 4th ed.

Colon Classification (3rd ed.)
type: NamedIndividual
type: Book
creator: Shiyali Ramamrita Ranganathan Ayyar
has version: Colon Classification (4th ed.)
publisher: Madras Library Association
place of publication: Madras
created: 1950
edition: 3rd ed.

Colon Classification (4th ed.)
type: NamedIndividual
type: Book
creator: Shiyali Ramamrita Ranganathan Ayyar
has version: Colon Classification (5th ed.)
publisher: Madras Library Association
place of publication: Madras
created: 1952
edition: 4th ed.

Colon Classification (5th ed.)
type: NamedIndividual
type: Book
creator: Shiyali Ramamrita Ranganathan Ayyar
has version: Colon Classification (6th ed.)
publisher: Madras Library Association
place of publication: Madras
created: 1957
edition: 5th ed.

Colon Classification (6th ed.)
type: NamedIndividual
type: Book
creator: Shiyali Ramamrita Ranganathan Ayyar
has version: Colon Classification: Basic and Depth Version
publisher: Asia Publishing House
place of publication: Bombay
created: 1960
edition: 6th ed.

Colon Classification: Basic and Depth Version
type: NamedIndividual
type: Book
creator: Shiyali Ramamrita Ranganathan Ayyar
publisher: Sarada Ranganathan Endowment for Library Science
editor: Malur Aji Gopinath
place of publication: Bangalore
created: 1987
edition: 7th ed.
description: Seventh Edition

Classified Catalogue Code (4th ed.)
type: NamedIndividual
type: Book
creator: Shiyali Ramamrita Ranganathan Ayyar
publisher: Madras Library Association
place of publication: Madras
created: 1958
edition: 4th ed.

Classification Research Group
type: NamedIndividual
type: Association
founding location: London
member: Douglas John Foskett
member: Bernard Ira Palmer
member: A. J. Wells
founding date: 1952

Calcutta
type: NamedIndividual
type: City
name: Kolkata
alternate name: Calcutta

Chidambaram
type: NamedIndividual
type: Administrative Area
contained in place: TamilNadu
name: Chidambaram

Christine Chomé
type: NamedIndividual
type: Woman
birth place: Luxembourg
has husband: Triplicaine Ranganathan Yogeshwar

Coimbatore
type: NamedIndividual
type: City
name: Coimbatore

Conflict01
type: NamedIndividual
type: Conflict
causal context: Travel01
involves participant: Shiyali Ramamrita Ranganathan Ayyar
involves participant: Seethalakshmi Ayyar
description: Travel to foreign land being against the South Indian customs.
has outcome: Ranganathan went abroad for studies, regardless.

Conflict03
type: NamedIndividual
type: Conflict
causal context: FamilyManagement
involves participant: Aviam
involves participant: Rukhmani
involves participant: Shiyali Ramamrita Ranganathan Ayyar
involves participant: Seethalakshmi Ayyar
description: Differences in opinion in running a joint family.
has outcome: Increasing hostility between wife and mother.

Conflict05
type: NamedIndividual
type: Conflict
causal context: EthnicConflict
causal context: PoliticalConflict
causal context: WorkRelated
involves participant: Arcot Lakshmanaswami Mudaliar
involves participant: Shiyali Ramamrita Ranganathan Ayyar
description: Differences in opinion and in political stance.
has outcome: Ranganathan left his job at the University of Madras

Contribution01
type: NamedIndividual
type: Contribution
subject: Colon Classification
subject: LibraryAndInformationScience
inspired by: MeccanoSet
contribution name: Facet Analysis

Contribution02
type: NamedIndividual
type: Contribution
subject: Theory of Library Catalogue
subject: LibraryAndInformationScience
contribution name: Chain Indexing

Contribution03
type: NamedIndividual
type: Contribution
subject: Five Laws of Library Science
subject: LibraryAndInformationScience
inspired by: Manusmriti
description: The conception of the Five Laws of Library Science was first publicly announced at Annamalai University.
contribution name: Five Laws of Library Science
event year: 1928

Contribution06
type: NamedIndividual
type: Contribution
subject: LibraryAndInformationScience
contribution name: Librametry
event year: 1948

Copenhagen
type: NamedIndividual
type: City
name: Copenhagen

Croydon Central Library
type: NamedIndividual
type: Library
contained in place: London
workplace of: William Charles Berwick Sayers

DLitt1 SRR
type: NamedIndividual
type: Honorary degree
degree awarded by: University of Delhi
degree awarded to: Shiyali Ramamrita Ranganathan Ayyar
description: Honoris causa
award year: 1948

DLitt2 SRR
type: NamedIndividual
type: Honorary degree
degree awarded by: University of Pittsburgh
degree awarded to: Shiyali Ramamrita Ranganathan Ayyar
description: Honoris causa
award year: 1964

Documentation Research and Training Centre
type: NamedIndividual
type: Education Organization
unit of: Indian Statistical Institute
contained in place: Bangalore
founding location: Malleshwaram
workplace of: Malur Aji Gopinath
workplace of: Arashanapalai Neelameghan
workplace of: Shiyali Ramamrita Ranganathan Ayyar
founding date: 1962

Prof. S. R. Ranganathan: Museum & Archives
type: NamedIndividual
type: Museum
dedicated to: Shiyali Ramamrita Ranganathan Ayyar
unit of: Documentation Research and Training Centre
has item: Bust SRR

Svend Dahl
type: NamedIndividual
type: Man
acquaintance of: Shiyali Ramamrita Ranganathan Ayyar
has work history: emp28
has occupation: Librarian
first name: Svend
given name: Dahl
has epithet: Soulabhya

S. Dasgupta
type: NamedIndividual
type: Man
apprentice to: Shiyali Ramamrita Ranganathan Ayyar
close friend of: Shiyali Ramamrita Ranganathan Ayyar
colleague of: Shiyali Ramamrita Ranganathan Ayyar
has occupation: Librarian
has occupation: Professor
member Of: Indian Library Association
given name: Dasgupta

Delhi
type: NamedIndividual
type: City
contained in place: India
name: Delhi
alternate name: New Delhi
alternative label: New Delhi

Delhi Library Association
type: NamedIndividual
type: Association
contained in place: Delhi
member: S. Dasgupta
member: P. N. Kaula
member: Shiyali Ramamrita Ranganathan Ayyar
founding date: 1939

Delhi Public Library
type: NamedIndividual
type: Library
contained in place: Delhi
founding date: 1951

DiplomaCert Yogeshwar
type: NamedIndividual
type: Professional Degree
degree awarded by: Eidgenössische Technische Hochschule Zürich
degree awarded in: MachineToolEngineering
description: Diploma Certificate in Machine Tool Engineering and Production Technology
award year: 1956

Documentation Committee
type: NamedIndividual
type: Committee
member: Shiyali Ramamrita Ranganathan Ayyar
member Of: Indian Standards Institution
founded by: Shiyali Ramamrita Ranganathan Ayyar
founding date: 1947

Draft Model Indian Library Act
type: NamedIndividual
type: Legislation
creator: Shiyali Ramamrita Ranganathan Ayyar
publisher: Indian Library Association
place of publication: Calcutta
created: 1942

Dress Style1
type: NamedIndividual
type: Dressing Habit
dress worn in: India
has accessory.: Tie1
has accessory.: Turban1
has bottomwear: Dhoti1
has outerwear: Jacket1
has topwear: Shirt1
description: On Professional Occasions, from 1920s.

Dress Style2
type: NamedIndividual
type: Dressing Habit
dress worn in: London
has accessory.: Turban1
has bottomwear: Pants1
has outerwear: Waistcoat1
has topwear: Shirt2
has topwear: Waistjacket1
has undergarment: Underwear1
description: Dress worn in London, 1924 during the winter.

Dress Style6
type: NamedIndividual
type: Dressing Habit
has accessory.: Angavastra
has accessory.: Turban1
has bottomwear: Dhoti1
has footwear: Shoes1
has outerwear: Achkan
has topwear: Shirt1
description: Dress worn while traveliing abroad from 1940s onward.

Eidgenössische Technische Hochschule Zürich
type: NamedIndividual
type: University
contained in place: Zurich
workplace of: Erich Bickel
workplace of: Christine Chomé
workplace of: Triplicaine Ranganathan Yogeshwar
alternate name: Swiss Federal Institute of Technology

Edinburgh
type: NamedIndividual
type: City
name: Edinburgh

Public Library Provision and Documentation Problems
type: NamedIndividual
type: Edited Book
publisher: Indian Library Association
editor: Shiyali Ramamrita Ranganathan Ayyar
place of publication: Delhi
created: 1951
description: Papers for Discussion at All India Library Conference, 9, 11-14 May 1951

The Library Movement: A Collection of Essays by Diverse Hands
type: NamedIndividual
type: Edited Book
publisher: Madras Library Association
place of publication: Madras
created: 1929

EditedBook06
type: NamedIndividual
type: Edited Book
publisher: Asia Publishing House
editor: Shiyali Ramamrita Ranganathan Ayyar
place of publication: Bombay
created: 1963
description: A Symposium of Seventy Papers by Thirty-two Authors
description: Documentation and its Facets

Report of the All Asia Educational Conference
type: NamedIndividual
type: Edited Book
place of publication: Allahabad

Edward Goldston, Ltd.
type: NamedIndividual
type: Publisher

Ejnar Munksgaard
type: NamedIndividual
type: Publisher
label: Ejnar Munskgaard

Endowment01
type: NamedIndividual
type: Endowment
endowment to: Madras Christian College
in honor of: Edward Burns Ross
endowment name: Edward B. Ross Studentship
endowment year: 1934

Endowment02
type: NamedIndividual
type: Endowment
endowment to: University of Madras
in honor of: Vangal Lakshmana Sarada
description: A sum of 1 lakh rupees was contributed.
endowment name: Sarada Ranganathan Chair of Library Science
endowment year: 1956

Endowment06
type: NamedIndividual
type: Endowment
in honor of: Vangal Lakshmana Sarada
endowment name: Sarada Ranganathan Endowment for Library Science
endowment year: 1961

England
type: NamedIndividual
type: Country
contains city: London
name: England

Europe
type: NamedIndividual
type: Continent
contains city: London
contains country: England
contains country: France
contains country: Germany
contains country: Luxembourg
contains country: Netherlands
contains country: Norway
contains country: Poland
contains country: Russia
contains country: Scotland
contains country: Sweden
contains country: Switzerland
name: Europe

International Federation for Information and Documentation
type: NamedIndividual
type: Association
type: Publisher
member: Arashanapalai Neelameghan
member: Shiyali Ramamrita Ranganathan Ayyar
alternate name: FID
alternate name: FID/CR

Female
type: NamedIndividual
type: Gender Type
comment: The female gender

Shulim Sussman
type: NamedIndividual
type: Man
close friend of: Christine Chomé
close friend of: Shiyali Ramamrita Ranganathan Ayyar
close friend of: Vangal Lakshmana Sarada
close friend of: Triplicaine Ranganathan Yogeshwar
has occupation: Dentist
nickname: Foschi
description: Best Man during Yogeshwar's wedding
honorific prefix: Dr.

Douglas John Foskett
type: NamedIndividual
type: Man
close friend of: Shiyali Ramamrita Ranganathan Ayyar
friend of: Bernard Ira Palmer
friend of: Triplicaine Ranganathan Yogeshwar
influenced by: Shiyali Ramamrita Ranganathan Ayyar
founder: Classification Research Group
has occupation: Author
has occupation: IntelligenceOfficer
has occupation: Librarian
member Of: Classification Research Group
specialization: LibraryAndInformationScience
first name: Douglas
given name: Foskett

France
type: NamedIndividual
type: Country
contains city: Paris
name: France

Frankfurt
type: NamedIndividual
type: City
contained in place: Germany
name: Frankfurt

Government College of Mangalore
type: NamedIndividual
type: College
contained in place: Mangalore
workplace of: Shiyali Ramamrita Ranganathan Ayyar

Government College of Coimbatore
type: NamedIndividual
type: College
contained in place: Coimbatore
workplace of: Shiyali Ramamrita Ranganathan Ayyar

G. A. Srinivasa Ayyar
type: NamedIndividual
type: Man
close friend of: Shiyali Ramamrita Ranganathan Ayyar
has work history: emp07
has occupation: Professor
specialization: Mathematics
nickname: GAS

P. K. Garde
type: NamedIndividual
type: Man
apprentice to: Shiyali Ramamrita Ranganathan Ayyar
close friend of: Shiyali Ramamrita Ranganathan Ayyar
colleague of: Shiyali Ramamrita Ranganathan Ayyar
friend of: Triplicaine Ranganathan Yogeshwar
has occupation: Librarian
has occupation: Professor
specialization: LibraryAndInformationScience
has epithet: Ranganathan's other son.

Germany
type: NamedIndividual
type: Country
name: Germany

Girja Kumar
type: NamedIndividual
type: Person
acquaintance of: Shiyali Ramamrita Ranganathan Ayyar
apprentice to: Shiyali Ramamrita Ranganathan Ayyar
has occupation: Author
has occupation: Librarian
member: Indian Library Association
first name: Girja
given name: Kumar

Glasgow
type: NamedIndividual
type: City
name: Glasgow

Malur Aji Gopinath
type: NamedIndividual
type: Man
apprentice to: Shiyali Ramamrita Ranganathan Ayyar
close friend of: Shiyali Ramamrita Ranganathan Ayyar
colleague of: Shiyali Ramamrita Ranganathan Ayyar
influenced by: Shiyali Ramamrita Ranganathan Ayyar
works with: Shiyali Ramamrita Ranganathan Ayyar
has work history: emp30
has occupation: Author
has occupation: Professor
specialization: LibraryAndInformationScience

Government of India
type: NamedIndividual
type: Government Organization

GrandKnightOfPeace
type: NamedIndividual
type: Honorary Title
award: Grand Knight of Peace

Ranganathan Gregoire Yogeshwar
type: NamedIndividual
type: Man
has occupation: Journalist
has father: Triplicaine Ranganathan Yogeshwar
has grandfather: Shiyali Ramamrita Ranganathan Ayyar
has mother: Christine Chomé
has sister: Tau Jeanne Sarada Yogeshwar
specialization: Physics
birth year: 1959

Sir Maurice Gwyer
type: NamedIndividual
type: Man
close friend of: Shiyali Ramamrita Ranganathan Ayyar
has work history: emp08
has work history: emp09
has occupation: Judge
has goal: Creating centres for Advanced Education in India

G. H. Hardy
type: NamedIndividual
type: Man
acquaintance of: Shiyali Ramamrita Ranganathan Ayyar
mentor of: Srinivasa Aiyangar Ramanujan
has occupation: Professor
specialization: Mathematics
given name: Hardy

Harihara
type: NamedIndividual
type: City
name: Harihara

HealthRecord01 P3
type: NamedIndividual
type: Health Record
associated anatomy: Foot
is health record of: Shiyali Ramamrita Ranganathan Ayyar
diagnosed with: Local infection of wound
has symptom: Limping
has symptom: RednessAndSwelling
has treatment procedure: AyurvedicPaste
description: Septic wound in his foot due to barefoot walking in Madras.

HealthRecord02 P3
type: NamedIndividual
type: Health Record
associated anatomy: LeftLegCalf
is health record of: Shiyali Ramamrita Ranganathan Ayyar
diagnosed with: Rupture of gastrocnemius tendon
has symptom: ExtremePain
has symptom: Immobility
has treatment procedure: RestAndRehabilitation
description: Sudden collapse due to a torn calf muscle
encounter date: 1936

HealthRecord03 P3
type: NamedIndividual
type: Health Record
is health record of: Shiyali Ramamrita Ranganathan Ayyar
diagnosed with: Solar erythema
has symptom: Blisters
has symptom: PeelingSkin
has treatment procedure: Medication
encounter date: 1955

HealthRecord04 P3
type: NamedIndividual
type: Health Record
associated anatomy: Lungs
is health record of: Shiyali Ramamrita Ranganathan Ayyar
treated by: Dr. S. S. Jayaram
diagnosed with: Bronchitis
has symptom: Acute Respiratory Distress
has treatment procedure: Oxygen Therapy
has treatment procedure: Medication
encounter date: 1966

HealthRecord06 P3
type: NamedIndividual
type: Health Record
associated anatomy: Gums
associated anatomy: Teeth
is health record of: Shiyali Ramamrita Ranganathan Ayyar
treated by: Shulim Sussman
diagnosed with: Malocclusion of Teeth
has symptom: Bleeding Gums
has symptom: SensitiveTeeth
has treatment procedure: Denture
has treatment procedure: Medication
description: Use of cobra venom to get bleeding under control.
encounter date: 1955

Hindu Higher Secondary School
type: NamedIndividual
type: School
contained in place: Madras
workplace of: P. A. Subramanya Ayyar

HonWork01
type: NamedIndividual
type: Honorary Work
affiliation: Meenakshi College
job title: GuestLecturer
event year: 1928

HonWork02
type: NamedIndividual
type: Honorary Work
affiliation: Saidapet Teachers' College
job title: VisitingLecturer
tenure from: 1928
tenure till: 1933

HonWork03
type: NamedIndividual
type: Honorary Work
affiliation: University of Madras
job title: HonoraryProfessor
tenure from: 1929
tenure till: 1944

HonWork04
type: NamedIndividual
type: Honorary Work
affiliation: University of Bombay
job title: VisitingLecturer
event year: 1944

HonWork05
type: NamedIndividual
type: Honorary Work
affiliation: Banaras Hindu University
job title: HonoraryProfessor
tenure from: 1945
tenure till: 1947

HonWork06
type: NamedIndividual
type: Honorary Work
affiliation: University of Delhi
job title: HonoraryProfessor
preceded by: emp05
tenure from: 1949
tenure till: 1955

HonWork07
type: NamedIndividual
type: Honorary Work
affiliation: University of Pittsburgh
job title: VisitingLecturer
event year: 1964

HonoursCertificate SRR
type: NamedIndividual
type: Professional Degree
degree awarded by: LondonUniversityCollege
degree awarded in: LibraryAndInformationScience
preceded by: LTDegree SRR
description: Honours Certificate in Librarianship
award year: 1925

House1
type: NamedIndividual
type: Residence
contained in place: Shiyali
alternate name: Birth House Of Ranganathan
street address: North Rampart Street

House2
type: NamedIndividual
type: Residence
contained in place: Triplicane
street address: 15, Sami Pillai Street
resided from: 1925
resided till: 1945

House4
type: NamedIndividual
type: Residence
contained in place: MauriceNagar
street address: C6, Maurice Nagar Colony.
resided from: 1947
resided till: 1955

House5
type: NamedIndividual
type: Residence
contained in place: Zurich
street address: Apartment in 248 Hofwiesenstrasse.
resided from: 1955
resided till: 1957

Indian Adult Education Association
type: NamedIndividual
type: Association
member: Shiyali Ramamrita Ranganathan Ayyar

Indian Association of Special Libraries and Information Centres
type: NamedIndividual
type: Association
contained in place: Calcutta
member: Shiyali Ramamrita Ranganathan Ayyar
founding date: 1955

International Federation of Library Associations and Institutions
type: NamedIndividual
type: International Organization
member: Shiyali Ramamrita Ranganathan Ayyar

Indian National Scientific Documentation Centre
type: NamedIndividual
type: Government Organization
workplace of: Parthasarathy
founding date: 1952

Indian Statistical Institute
type: NamedIndividual
type: University
has Unit: Documentation Research and Training Centre
workplace of: Prasanta Chandra Mahalanobis
workplace of: Shiyali Ramamrita Ranganathan Ayyar
founding date: 1931

India
type: NamedIndividual
type: Country
contains city: Bangalore
contains city: Bombay
contains city: Coimbatore
contains city: Delhi
contains city: Madras
contains city: Mangalore
contains city: Varanasi
contains state: Karnataka
contains state: TamilNadu
contains village: Shiyali
contains village: Ubhayavedantapuram
name: India

Indian Library Association
type: NamedIndividual
type: Association
type: Publisher
member: P. N. Kaula
member: Shiyali Ramamrita Ranganathan Ayyar
founding date: 1933

Indian Mathematical Society
type: NamedIndividual
type: Association
contained in place: Madras

Indian Standards Institution
type: NamedIndividual
type: Government Organization
member: Shiyali Ramamrita Ranganathan Ayyar
alternate name: Bureau of Indian Standards

Ireland
type: NamedIndividual
type: Country
name: Ireland

M. R. Narsimha Iyengar
type: NamedIndividual
type: Man
friend of: Shiyali Ramamrita Ranganathan Ayyar
has occupation: CivilServant
member Of: Mysore Library Association

Jaipur
type: NamedIndividual
type: City
name: Jaipur

Dr. S. S. Jayaram
type: NamedIndividual
type: Man
friend of: Shiyali Ramamrita Ranganathan Ayyar
friend of: Triplicaine Ranganathan Yogeshwar
has occupation: Doctor
given name: Jayaram

Jeanne Chomé
type: NamedIndividual
type: Woman
is mother of: Christine Chomé
is wife of: Pierre Chomé
first name: Jeanne
nickname: Mammi
given name: Chomé

Educational Review
type: NamedIndividual
type: Journal

Journal of the Indian Mathematical Society
type: NamedIndividual
type: Journal

South Indian Teacher
type: NamedIndividual
type: Journal

Scholar
type: NamedIndividual
type: Journal

Annual Report of Madras Library Association
type: NamedIndividual
type: Journal

Modern Librarian
type: NamedIndividual
type: Journal

V. L. Kalyanasundaram
type: NamedIndividual
type: Man
interest: CinemaOuting
has occupation: Businessman
is brother of: Vangal Lakshmana Sarada
nickname: Ambi Mama

Karnataka
type: NamedIndividual
type: State
contains city: Bangalore
contains city: Harihara
contains city: Mangalore
name: Karnataka

P. N. Kaula
type: NamedIndividual
type: Man
apprentice to: Shiyali Ramamrita Ranganathan Ayyar
close friend of: Shiyali Ramamrita Ranganathan Ayyar
colleague of: Shiyali Ramamrita Ranganathan Ayyar
has work history: emp27
founder: Sarada Ranganathan Endowment for Library Science
has occupation: Author
has occupation: Librarian
has occupation: Professor
first name: Prithvi Nath
given name: Kaula

K.V. Krishnaswamy Ayyar
type: NamedIndividual
type: Man
close friend of: Shiyali Ramamrita Ranganathan Ayyar
founder: Madras Library Association
has occupation: Lawyer
member Of: Madras Library Association
given name: Krishnaswamy
has epithet: live wire

Kudumi
type: NamedIndividual
type: Hair Style
description: Long hair bundled into a bun

Library Association of the United Kingdom
type: NamedIndividual
type: Association
type: Publisher
contained in place: London
member: Douglas John Foskett
member: Bernard Ira Palmer
member: Shiyali Ramamrita Ranganathan Ayyar
member: William Charles Berwick Sayers
member: A. J. Wells
alternate name: CILIP
alternate name: Chartered Institute of Library and Information Professionals
alternate name: Library Association
founding date: 1877

LTDegree SRR
type: NamedIndividual
type: Professional Degree
degree awarded by: Saidapet Teachers' College
degree awarded in: Pedagogy
preceded by: MA SRR
description: Licenciate in Teaching
award year: 1917

Lahore
type: NamedIndividual
type: City

V. K. Lakshmana
type: NamedIndividual
type: Man
has occupation: Businessman
has son: V. L. Kalyanasundaram
is father of: Vangal Lakshmana Sarada

Madras Public Library Bill
type: NamedIndividual
type: Bill
publisher: Madras Library Association
editor: Shiyali Ramamrita Ranganathan Ayyar
place of publication: Madras
created: 1934

London
type: NamedIndividual
type: City
name: London

LondonUniversityCollege
type: NamedIndividual
type: College
contained in place: London
workplace of: William Charles Berwick Sayers
alternate name: University College of London

Luxembourg
type: NamedIndividual
type: Country
name: Luxembourg

MA SRR
type: NamedIndividual
type: Master's Degree
degree awarded by: Madras Christian College
degree awarded in: Mathematics
description: M.A. in Mathematics
award year: 1916

Madan Mohan Malaviya
type: NamedIndividual
type: Man
acquaintance of: Shiyali Ramamrita Ranganathan Ayyar
founder: Banaras Hindu University
has occupation: Lawyer
has occupation: PoliticalStatesman
given name: Malaviya
honorific prefix: Madan Mohan
honorific prefix: Pandit
has epithet: Mahamana

Madras
type: NamedIndividual
type: City
contains locality: Saidapet
contains locality: Triplicane
contains locality: Washermanpet
name: Chennai
alternate name: Madras

Madras Christian College
type: NamedIndividual
type: College
contained in place: Madras
workplace of: Edward Burns Ross
alternate name: MCC

Madras Library Association
type: NamedIndividual
type: Association
type: Publisher
type: Organization
founding location: Madras
member: Shiyali Ramamrita Ranganathan Ayyar
alternate name: MALA
founding date: 1928

The Madras Mail
type: NamedIndividual
type: Newspaper
alternate name: The Mail

Madrasi Education Association
type: NamedIndividual
type: Publisher

Prasanta Chandra Mahalanobis
type: NamedIndividual
type: Man
friend of: Shiyali Ramamrita Ranganathan Ayyar
has work history: emp18
founder: Documentation Research and Training Centre
founder: Indian Statistical Institute
has occupation: PoliticalStatesman
has occupation: Professor
specialization: Mathematics
specialization: Statistics
given name: Mahalanobis
alternate name: P. C. Mahalanobis
has epithet: Father of Statistics in India

Maharashtra
type: NamedIndividual
type: State
contains city: Bombay
name: Maharashtra

Male
type: NamedIndividual
type: Gender Type
comment: The male gender

Malleshwaram
type: NamedIndividual
type: Locality
contained in place: Bangalore
contains place: Documentation Research and Training Centre
name: Malleshwaram

Mangalore
type: NamedIndividual
type: City
name: Mangalore

Manusmriti
type: NamedIndividual
type: Book
inspiration of: Shiyali Ramamrita Ranganathan Ayyar
alternate name: Code of Manu

MargaretMannCitation
type: NamedIndividual
type: Honorary Title
award: Margaret Mann Citation
comment: Award for outstanding professional achievement in cataloging or classification

Mark Twain Society
type: NamedIndividual
type: Association
contained in place: USA

Mathematics and Science Association of the Govertment College of Mangalore.
type: NamedIndividual
type: Association
contained in place: Mangalore
member: Shiyali Ramamrita Ranganathan Ayyar

Matriculation SRR
type: NamedIndividual
type: Matriculation Degree
degree awarded by: Sabhanayaka Mudaliar High School
followed by: BA SRR
description: Matriculation
award year: 1909

MauriceNagar
type: NamedIndividual
type: Locality
name: Maurice Nagar

Meal BF1
type: NamedIndividual
type: Breakfast
has food item: Bread
has food item: Milk
has food item: TapiocaPorridge
is type of: VegetarianFood
meal consumed in: London
description: Recorded from the year 1924

Meal BF2
type: NamedIndividual
type: Breakfast
has food item: Curd
has food item: Dal
has food item: Milk
has food item: Pickle
has food item: Rasam
has food item: Rice
has food item: WaferFries
is type of: VegetarianFood
meal consumed in: Madras
description: Recorded from the 1930s in Madras.

Meal Dinner1
type: NamedIndividual
type: Dinner
has food item: Chapati
has food item: Fruits
has food item: Milk
has food item: RicePudding
is type of: VegetarianFood
meal consumed in: London
description: Recorded from the year 1924

Meal Festive1
type: NamedIndividual
type: Special Dish
has food item: SakkaraiPongal
has food item: VellaiPongal
is type of: VegetarianFood
meal consumed in: Madras
description: Meal consumed on special and festive occasions such as the month of Maargazhi.

Meal Lunch1
type: NamedIndividual
type: Lunch
has food item: LentilSoup
has food item: Papadam
has food item: Raaita
has food item: Rice
has food item: VegStew
is type of: VegetarianFood
meal consumed in: London
description: Recorded from the year 1924

Meal Lunch2
type: NamedIndividual
type: Lunch
has food item: Curd
has food item: Dosa
has food item: Idli
has food item: Rice
is type of: VegetarianFood
meal consumed in: Madras
description: Recorded from the 1930s in Madras.

Meenakshi College
type: NamedIndividual
type: College
contained in place: Chidambaram
workplace of: Shiyali Ramamrita Ranganathan Ayyar
alternate name: Annamalai University

Model Library Act
type: NamedIndividual
type: Legislation
creator: Shiyali Ramamrita Ranganathan Ayyar
publisher: Madras Library Association
place of publication: Madras
created: 1931

Arcot Lakshmanaswami Mudaliar
type: NamedIndividual
type: Man
acquaintance of: Shiyali Ramamrita Ranganathan Ayyar
has occupation: Doctor
has occupation: Professor
specialization: ObstetricsAndGynaecology
first name: Lakshmanaswami
given name: Mudaliar
honorific prefix: Dr.

Mysore Library Association
type: NamedIndividual
type: Association
contained in place: Karnataka
alternate name: KALA
founding date: 1962

N. K. Publishing House
type: NamedIndividual
type: Publisher

NandiHills
type: NamedIndividual
type: Tourist Attraction
contained in place: Karnataka
name: Nandi Hills

NationalResearchProfessor
type: NamedIndividual
type: Honorary Title
award: National Research Professorship
comment: Indian scholastic award

Arashanapalai Neelameghan
type: NamedIndividual
type: Man
apprentice to: Shiyali Ramamrita Ranganathan Ayyar
close friend of: Shiyali Ramamrita Ranganathan Ayyar
colleague of: Shiyali Ramamrita Ranganathan Ayyar
influenced by: Shiyali Ramamrita Ranganathan Ayyar
works with: Shiyali Ramamrita Ranganathan Ayyar
has work history: emp31
founder: Sarada Ranganathan Endowment for Library Science
has occupation: Author
has occupation: Professor
specialization: LibraryAndInformationScience

Netherlands
type: NamedIndividual
type: Country
name: Netherlands
alternate name: Holland

NewYork
type: NamedIndividual
type: City
name: New York

NilgiriHills
type: NamedIndividual
type: Tourist Attraction
contained in place: TamilNadu
name: Nilgiri Mountains

NorthAmerica
type: NamedIndividual
type: Continent
contains country: USA
name: North America

Norway
type: NamedIndividual
type: Country
name: Norway

NoseScar
type: NamedIndividual
type: Identification Mark
description: Nose Scar resulting from an injury used as visibly distinguishing marks'.

Oxford University Press
type: NamedIndividual
type: Publisher

Pierre Chomé
type: NamedIndividual
type: Man
has occupation: MachineToolDesigner
is father of: Christine Chomé
specialization: MachineToolEngineering
first name: Pierre
given name: Chomé
death year: 1954

PadmaShri
type: NamedIndividual
type: Honorary Title
award: Padma Shri
comment: Fourth highest civilian award in India

Bernard Ira Palmer
type: NamedIndividual
type: Man
close friend of: Shiyali Ramamrita Ranganathan Ayyar
influenced by: Shiyali Ramamrita Ranganathan Ayyar
birth place: England
has occupation: IntelligenceOfficer
has occupation: Librarian
specialization: LibraryAndInformationScience
first name: Bernard
given name: Palmer

Paris
type: NamedIndividual
type: City
name: Paris

Parthasarathy
type: NamedIndividual
type: Man
apprentice to: Shiyali Ramamrita Ranganathan Ayyar
close friend of: Shiyali Ramamrita Ranganathan Ayyar
colleague of: Shiyali Ramamrita Ranganathan Ayyar
has occupation: Professor
specialization: LibraryAndInformationScience
first name: Srirangapattanam Parthasarathy
given name: Parthasarathy

Pennsylvania
type: NamedIndividual
type: State
name: Pennsylvania

Pierre Kalyana Yogeshwar
type: NamedIndividual
type: Man
has occupation: Professor
has brother: Ranganathan Gregoire Yogeshwar
has father: Triplicaine Ranganathan Yogeshwar
has mother: Christine Chomé
has sister: Tau Jeanne Sarada Yogeshwar
specialization: Physics
birth year: 1959

Pittsburgh
type: NamedIndividual
type: City
contained in place: Pennsylvania
name: Pittsburgh

Poland
type: NamedIndividual
type: Country
name: Poland

Presidency College
type: NamedIndividual
type: College
workplace of: G. A. Srinivasa Ayyar
workplace of: Shiyali Ramamrita Ranganathan Ayyar
workplace of: P. Venkatesvara Seshu Aiyar

ProWork01
type: NamedIndividual
type: Professional Affiliation
affiliation: Indian Library Association
job title: President
tenure from: 1944
tenure till: 1953

ProWork02
type: NamedIndividual
type: Professional Affiliation
affiliation: Documentation Committee
job title: Chairman
tenure till: 1947
tenure till: 1966

ProWork03
type: NamedIndividual
type: Professional Affiliation
affiliation: Madras Library Association
job title: Secretary
tenure from: 1928
tenure till: 1953

ProWork04
type: NamedIndividual
type: Professional Affiliation
affiliation: Indian Mathematical Society
job title: Treasurer
tenure from: 1928
tenure till: 1934

ProWork05
type: NamedIndividual
type: Professional Affiliation
affiliation: Indian Adult Education Association
job title: Secretary
tenure from: 1949
tenure till: 1953

ProWork06
type: NamedIndividual
type: Professional Affiliation
affiliation: International Federation for Information and Documentation
job title: Rapporteur-General
tenure from: 1951
tenure till: 1961

Pune
type: NamedIndividual
type: City
contained in place: Maharashtra

Punjab Library Association
type: NamedIndividual
type: Publisher

Purushottaman
type: NamedIndividual
type: Man
has occupation: Landowner

Quote01
type: NamedIndividual
type: Quote
is quote of: Shiyali Ramamrita Ranganathan Ayyar
description: The function of the library was to make “all sorts of fellows” use its books and that the dust problem should not be allowed to drive away the library beyond the zone of accessibility and usefulness.

Quote02
type: NamedIndividual
type: Quote
is quote of: Shiyali Ramamrita Ranganathan Ayyar
description: Our right is only to do the work falling to our share, never to the fruits of our work. Flirt not with fruits.

Quote03
type: NamedIndividual
type: Quote
is quote of: Shiyali Ramamrita Ranganathan Ayyar
description: Library is my home, no one wears shoes at home.

Quote04
type: NamedIndividual
type: Quote
is quote of: Shiyali Ramamrita Ranganathan Ayyar
description: Eternity can be contained in a moment

Rajasthan
type: NamedIndividual
type: State
contains city: Jaipur
name: Jaipur

Ramamrita Ayyar
type: NamedIndividual
type: Man
death place: Ubhayavedantapuram
has occupation: Landowner
knows language: SanskritLanguage
knows language: TamilLanguage
follows religion: Hinduism
has brother: Purushottaman
has food habit: VegetarianFood
has wife: Seethalakshmi Ayyar
inspired by: ValmikiRamayana
is father of: Shiyali Ramamrita Ranganathan Ayyar
is husband of: Seethalakshmi Ayyar
cause of death: Cholera
death year: 1898
has epithet: Wise Man of Shiyali
time of death: 13-01-1898

C. V. Raman
type: NamedIndividual
type: Man
has occupation: Professor
guest of: Shiyali Ramamrita Ranganathan Ayyar
specialization: Physics
given name: Raman
honorific prefix: Sir

Srinivasa Aiyangar Ramanujan
type: NamedIndividual
type: Man
apprentice to: G. H. Hardy
influenced by: G. H. Hardy
influenced by: V. Ramaswamy Ayyar
inspiration of: Shiyali Ramamrita Ranganathan Ayyar
specialization: Mathematics
first name: Srinivasa Aiyangar
given name: Ramanujan
has epithet: Ranganathan's hero figure

V. Ramaswamy Ayyar
type: NamedIndividual
type: Man
close friend of: Shiyali Ramamrita Ranganathan Ayyar
mentor of: Srinivasa Aiyangar Ramanujan
founder: Indian Mathematical Society
has occupation: CivilServant
member Of: Indian Mathematical Society
inspiration of: Shiyali Ramamrita Ranganathan Ayyar
specialization: Mathematics
given name: Ramaswamy
has epithet: Ranganathan's moral uncle
has epithet: bundle of energy

Rameswaram
type: NamedIndividual
type: Administrative Area
contained in place: TamilNadu
name: Rameswaram

Rao Sahib
type: NamedIndividual
type: Honorary Title
award: Rao Sahib
comment: Title of honour issued during the era of British rule in India to individuals who performed great service in visionary leadership to the nation
alternative label: Rai Saheb

Rockefeller Foundation
type: NamedIndividual
type: Foundation
contained in place: NewYork
member: Shiyali Ramamrita Ranganathan Ayyar

Edward Burns Ross
type: NamedIndividual
type: Man
mentor of: Srinivasa Aiyangar Ramanujan
mentor of: Shiyali Ramamrita Ranganathan Ayyar
has work history: emp06
has occupation: Professor
inspiration of: Shiyali Ramamrita Ranganathan Ayyar
specialization: Mathematics
first name: Edward
given name: Ross
honorific prefix: Prof.
has epithet: Ranganathan's intellectual father

Routine01
type: NamedIndividual
type: Daily Routine
followed by: Routine02
has activity: WakingUp
description: From 1930s, during his tenure as Madras University Librarian.
start time: At Dawn

Routine02
type: NamedIndividual
type: Daily Routine
followed by: Routine03
has activity: Walking
start time: Around 6 AM.

Routine12
type: NamedIndividual
type: Daily Routine
has activity: WorkingOnJob
activity duration: 12-16 hours in a day.

Rukhmani
type: NamedIndividual
type: Woman
engaged to: Shiyali Ramamrita Ranganathan Ayyar
birth place: Thanjavur
death place: Triplicane
has occupation: Homemaker
follows religion: Hinduism
has food habit: VegetarianFood
has husband: Shiyali Ramamrita Ranganathan Ayyar
nickname: Kunju
cause of death: Drowning Accident
time of death: 13-11-1928

Russia
type: NamedIndividual
type: Country
name: Russia

Sabhanayaka Mudaliar High School
type: NamedIndividual
type: School
contained in place: Shiyali
workplace of: P. A. Subramanya Ayyar
workplace of: Thiruvenkatachariar

Sarada Ranganathan Endowment for Library Science
type: NamedIndividual
type: Foundation
type: Publisher
founding location: Karnataka
founding date: 1963

Shiyali Ramamrita Ranganathan Ayyar
type: NamedIndividual
type: Person
influenced by: William Charles Berwick Sayers
influenced by: P. A. Subramanya Ayyar
influenced by: T. Sundarachariar
influenced by: Thiruvenkatachariar
has work history: HonWork01
has work history: HonWork02
has work history: HonWork03
has work history: HonWork04
has work history: HonWork05
has work history: HonWork06
has work history: HonWork07
has work history: emp01
has work history: emp02
has work history: emp03
has work history: emp04
has work history: emp05
known for: Contribution01
known for: Contribution02
known for: Contribution03
known for: Contribution06
birth place: Shiyali
death place: Bangalore
founder: Documentation Research and Training Centre
founder: Documentation Committee
founder: Indian National Scientific Documentation Centre
founder: Indian Library Association
founder: Madras Library Association
founder: Mathematics and Science Association of the Govertment College of Mangalore.
founder: Mysore Library Association
founder: Sarada Ranganathan Endowment for Library Science
has occupation: Author
has occupation: Librarian
has occupation: Professor
knows language: EnglishLanguage
knows language: SanskritLanguage
knows language: TamilLanguage
member Of: Indian Mathematical Society
member Of: Mysore Library Association
endowed: Endowment01
endowed: Endowment02
endowed: Endowment06
follows religion: Hinduism
has award: Award01
has award: Award02
has award: Award03
has award: Award04
has award: Award05
has award: Award06
has award: Award07
has award: Award08
has award: Award09
has award: Award10
has award: Award11
has brother: Natesan
has degree: BA SRR
has degree: DLitt1 SRR
has degree: DLitt2 SRR
has degree: HonoursCertificate SRR
has degree: LTDegree SRR
has degree: MA SRR
has degree: Matriculation SRR
has dress style: Dress Style1
has dress style: Dress Style2
has dress style: Dress Style6
has father: Ramamrita Ayyar
has food habit: VegetarianFood
has guest: J. D. Bernal
has guest: Bernard Ira Palmer
has guest: T. Sundarachariar
has meal: Meal BF1
has meal: Meal BF2
has meal: Meal Dinner1
has meal: Meal Festive1
has meal: Meal Lunch1
has meal: Meal Lunch2
has mother: Seethalakshmi Ayyar
has personality trait: Parsimony
has personality trait: Workaholic

Saidapet
type: NamedIndividual
type: Locality
name: Saidapet

Saidapet Teachers' College
type: NamedIndividual
type: College
contained in place: Saidapet
workplace of: Shiyali Ramamrita Ranganathan Ayyar

Vangal Lakshmana Sarada
type: NamedIndividual
type: Woman
interest: CinemaOuting
birth place: Coimbatore
death place: Bangalore
has occupation: Homemaker
knows language: HindiLanguage
knows language: KannadaLanguage
knows language: TamilLanguage
knows language: TeluguLanguage
follows religion: Hinduism
has father: V. K. Lakshmana
has food habit: VegetarianFood
is mother of: Triplicaine Ranganathan Yogeshwar
is sister of: V. L. Kalyanasundaram
is wife of: Shiyali Ramamrita Ranganathan Ayyar
resided in: House2
first name: Sarada
given name: Ranganathan
cause of death: cerebral stroke
time of birth: 1928-10-07T00:00:00
time of death: 30-07-1985

William Charles Berwick Sayers
type: NamedIndividual
type: Man
mentor of: Shiyali Ramamrita Ranganathan Ayyar
has work history: emp10
has occupation: Librarian
has occupation: Professor
given name: Sayers

Scotland
type: NamedIndividual
type: Country
contains city: Edinburgh
contains city: Glasgow
name: Scotland

Seethalakshmi Ayyar
type: NamedIndividual
type: Woman
death place: Delhi
has occupation: Homemaker
follows religion: Hinduism
has food habit: VegetarianFood
has son: Shiyali Ramamrita Ranganathan Ayyar
cause of death: Fire Accident
death year: 1953

C. Seshachalam
type: NamedIndividual
type: Man
close friend of: Shiyali Ramamrita Ranganathan Ayyar
colleague of: Shiyali Ramamrita Ranganathan Ayyar
founder: Sarada Ranganathan Endowment for Library Science
has occupation: Businessman
owner of: Curzon & Co.

P. Venkatesvara Seshu Aiyar
type: NamedIndividual
type: Person
colleague of: Shiyali Ramamrita Ranganathan Ayyar
mentor of: Srinivasa Aiyangar Ramanujan
has occupation: Professor
member Of: Indian Mathematical Society
has ethnicity: SouthIndianAyyars
specialization: Mathematics

Shiyali
type: NamedIndividual
type: Village
name: Shiyali

Srinivasan
type: NamedIndividual
type: Man
has occupation: RailwaySafetyTechnician
is son of: Aviam
nickname: Seenu
has epithet: Ranganathan's favourite family member

P. A. Subramanya Ayyar
type: NamedIndividual
type: Man
mentor of: Shiyali Ramamrita Ranganathan Ayyar
has occupation: Teacher
follows religion: Hinduism

T. Sundarachariar
type: NamedIndividual
type: Man
friend of: Shiyali Ramamrita Ranganathan Ayyar
has occupation: Author
follows religion: Hinduism
specialization: SanskritStudies
specialization: Theology
given name: Sundarachariar
has epithet: A Walking Concordance

Supreme Court of India
type: NamedIndividual
type: Government Organization
contained in place: Delhi
workplace of: Sir Maurice Gwyer

Sweden
type: NamedIndividual
type: Country
name: Sweden

Switzerland
type: NamedIndividual
type: Country
contains city: Zurich
name: Switzerland

TamilNadu
type: NamedIndividual
type: State
contains city: Coimbatore
contains city: Madras
contains city: Thanjavur
contains village: Shiyali
contains village: Ubhayavedantapuram
name: Tamil Nadu

Tau Jeanne Sarada Yogeshwar
type: NamedIndividual
type: Woman
has occupation: FilmProducer
has father: Triplicaine Ranganathan Yogeshwar
has mother: Christine Chomé
birth year: 1963

Thanjavur
type: NamedIndividual
type: City
name: Thanjavur
alternate name: Tanjore

The Hindu
type: NamedIndividual
type: Newspaper

Thiruvenkatachariar
type: NamedIndividual
type: Man
mentor of: Shiyali Ramamrita Ranganathan Ayyar
specialization: SanskritStudies

Travel01
type: NamedIndividual
type: Travel
reason for travel: BusinessPurpose
reason for travel: EducationalPurpose
travel from: Washermanpet
travel to: London
travel undertaken by: Shiyali Ramamrita Ranganathan Ayyar
description: To receive Professional Education and Training in Library Science
mode of transport: By Ship, SS Mariana.
travel year: 1924

Travel02
type: NamedIndividual
type: Travel
reason for travel: PersonalAndFamilyPurpose
travel from: England
travel to: Rameswaram
travel undertaken by: Shiyali Ramamrita Ranganathan Ayyar
description: Return Journey
mode of transport: By Ship, MV Dumma
travel year: 1925

Travel05
type: NamedIndividual
type: Travel
reason for travel: BusinessPurpose
travel to: Edinburgh
travel undertaken by: Shiyali Ramamrita Ranganathan Ayyar
description: Library Tour and meeting with erstwhile mentors.
travel year: 1925

Travel07
type: NamedIndividual
type: Travel
reason for travel: RecreationalPurpose
reason for travel: ReligiousPurpose
travel from: Bangalore
travel to: NandiHills
travel undertaken by: Shiyali Ramamrita Ranganathan Ayyar
travel undertaken by: Vangal Lakshmana Sarada
description: Summer Holidays
travel year: 1931

Travel08
type: NamedIndividual
type: Travel
reason for travel: RecreationalPurpose
travel from: Madras
travel to: NilgiriHills
travel undertaken by: Shiyali Ramamrita Ranganathan Ayyar
description: Summer holidays with colleagues
travel year: 1930

Travel09
type: NamedIndividual
type: Travel
travel to: Chidambaram
travel undertaken by: Shiyali Ramamrita Ranganathan Ayyar
description: To present a couse of lectures at Meenakshi College.
travel year: 1928

Travel10
type: NamedIndividual
type: Travel
reason for travel: BusinessPurpose
travel from: Madras
travel to: Jaipur
travel undertaken by: Shiyali Ramamrita Ranganathan Ayyar
description: To attend the All-India Library Congress
mode of transport: By Train
travel year: 1944

Travel12
type: NamedIndividual
type: Travel
reason for travel: BusinessPurpose
travel from: Madras
travel to: Varanasi
travel undertaken by: Shiyali Ramamrita Ranganathan Ayyar
travel undertaken by: Vangal Lakshmana Sarada
travel undertaken by: Seethalakshmi Ayyar
travel undertaken by: Triplicaine Ranganathan Yogeshwar
description: Job Relocation
mode of transport: By Train
travel year: 1945

Travel13
type: NamedIndividual
type: Travel
reason for travel: BusinessPurpose
travel from: Varanasi
travel to: Delhi
travel undertaken by: Shiyali Ramamrita Ranganathan Ayyar
travel undertaken by: Vangal Lakshmana Sarada
travel undertaken by: Seethalakshmi Ayyar
travel undertaken by: Triplicaine Ranganathan Yogeshwar
description: On Maurice Gwyer’s invitation to join as lecturer at DU.
mode of transport: By Train
travel year: 1947

Travel14
type: NamedIndividual
type: Travel
reason for travel: PersonalAndFamilyPurpose
travel from: Delhi
travel to: Harihara
travel undertaken by: Shiyali Ramamrita Ranganathan Ayyar
travel undertaken by: Vangal Lakshmana Sarada
travel undertaken by: Triplicaine Ranganathan Yogeshwar
description: To see Yogeshwar off at his new internship.
mode of transport: By Train
travel year: 1951

Travel32
type: NamedIndividual
type: Travel
reason for travel: BusinessPurpose
reason for travel: PersonalAndFamilyPurpose
travel from: Delhi
travel to: Zurich
travel undertaken by: Shiyali Ramamrita Ranganathan Ayyar
travel undertaken by: Vangal Lakshmana Sarada
description: To meet with his son and to interact with ETH Institute regarding the field of documentation
mode of transport: By Flight
travel year: 1954

Travel34
type: NamedIndividual
type: Travel
reason for travel: PersonalAndFamilyPurpose
travel from: USA
travel to: Frankfurt
travel undertaken by: Shiyali Ramamrita Ranganathan Ayyar
description: To see the his newly born grand-daughter, Tau.
mode of transport: By Flight
travel year: 1964

Travel37
type: NamedIndividual
type: Travel
reason for travel: BusinessPurpose
travel from: London
travel to: Paris
travel undertaken by: Shiyali Ramamrita Ranganathan Ayyar
description: On the invitation of UNESCO
travel year: 1952

Triplicane
type: NamedIndividual
type: Locality
birth place of: Triplicaine Ranganathan Yogeshwar
death place of: Rukhmani
name: Triplicaine

UK
type: NamedIndividual
type: Country
contains country: England
contains country: Ireland
contains country: Scotland
name: United Kingdom
alternate name: Britain

USA
type: NamedIndividual
type: Country
contains city: NewYork
contains state: Pennsylvania
name: United States of America
alternate name: U.S.A.

Ubhayavedantapuram
type: NamedIndividual
type: Village
name: Ubayavedanthapuram

University of Bombay
type: NamedIndividual
type: University
workplace of: Shiyali Ramamrita Ranganathan Ayyar

University of Delhi
type: NamedIndividual
type: Publisher
type: University
contained in place: Delhi
workplace of: S. Dasgupta
workplace of: P. K. Garde
workplace of: Sir Maurice Gwyer
workplace of: Parthasarathy
workplace of: Shiyali Ramamrita Ranganathan Ayyar

University of Madras
type: NamedIndividual
type: University
contained in place: Madras
workplace of: Shiyali Ramamrita Ranganathan Ayyar

University of Pittsburgh
type: NamedIndividual
type: University
contained in place: Pittsburgh
workplace of: Shiyali Ramamrita Ranganathan Ayyar

ValmikiRamayana
type: NamedIndividual
type: Book
gifted by: P. A. Subramanya Ayyar
gifted to: Shiyali Ramamrita Ranganathan Ayyar
inspiration of: Shiyali Ramamrita Ranganathan Ayyar
description: Ranganathan's most valued possession

Varanasi
type: NamedIndividual
type: City
name: Varanasi
alternate name: Benaras

Ayyanki Venkataramanaiah
type: NamedIndividual
type: Man
friend of: Shiyali Ramamrita Ranganathan Ayyar
founder: Indian Library Association
founder: Madras Library Association
has occupation: Landowner
member Of: Indian Library Association
member Of: Madras Library Association

Virginia
type: NamedIndividual
type: State
contained in place: USA
name: Virginia

Bibliographical Society of the University of Virginia
type: NamedIndividual
type: Association
contained in place: Virginia
founding date: 1947

Washermanpet
type: NamedIndividual
type: Locality
contained in place: Madras
name: Washermanpet

A. J. Wells
type: NamedIndividual
type: Man
friend of: Bernard Ira Palmer
friend of: Shiyali Ramamrita Ranganathan Ayyar
influenced by: Shiyali Ramamrita Ranganathan Ayyar
founder: Classification Research Group
given name: Wells

Triplicaine Ranganathan Yogeshwar
type: NamedIndividual
type: Man
influenced by: T. Sundarachariar
has work history: emp29
founder: Sarada Ranganathan Endowment for Library Science
has occupation: Author
has occupation: Engineer
knows language: EnglishLanguage
knows language: FrenchLanguage
knows language: GermanLanguage
knows language: HindiLanguage
knows language: TamilLanguage
has daughter: Tau Jeanne Sarada Yogeshwar
has degree: BSc Yogeshwar
has degree: DiplomaCert Yogeshwar
has father: Shiyali Ramamrita Ranganathan Ayyar
has mother: Vangal Lakshmana Sarada
has son: Ranganathan Gregoire Yogeshwar
has son: Pierre Kalyana Yogeshwar
is husband of: Christine Chomé
resided in: House2
specialization: MachineToolEngineering
specialization: MechanicalEngineering
specialization: Physics
first name: Triplicaine Ranganathan
nickname: Naikutti
nickname: TRY
given name: Yogeshwar
time of birth: 1932-04-12T19:12:00

Zurich
type: NamedIndividual
type: City
contained in place: Switzerland
name: Zurich

emp01
type: NamedIndividual
type: Employment
job title: AssistantLecturer
employed at: Government College of Mangalore
followed by: emp02
description: Assistant Lecturer in Mathematics
tenure from: 1917
tenure till: 1920

emp02
type: NamedIndividual
type: Employment
job title: AssistantLecturer
employed at: Government College of Coimbatore
followed by: emp03
description: Assistant Lecturer in Mathematics
tenure from: 1920
tenure till: 1921

emp03
type: NamedIndividual
type: Employment
job title: AssistantProfessor
employed at: Presidency College
followed by: emp04
description: Assistant Professor in Mathematics
tenure from: 1921
tenure till: 1924

emp04
type: NamedIndividual
type: Employment
job title: UniversityLibrarian
employed at: University of Madras
followed by: emp05
estimated salary: Rs 250 per month with annual increments of Rs 25.
tenure from: 1924
tenure till: 1944

emp05
type: NamedIndividual
type: Employment
job title: UniversityLibrarian
employed at: Banaras Hindu University
tenure from: 1945
tenure till: 1947

emp08
type: NamedIndividual
type: Employment
job title: ViceChancellor
employed at: University of Delhi
tenure from: 1938
tenure till: 1950

emp09
type: NamedIndividual
type: Employment
job title: ChiefJustice
employed at: Supreme Court of India
tenure from: 1937
tenure till: 1943

emp18
type: NamedIndividual
type: Employment
job title: Director
employed at: Indian Statistical Institute
work history of: Prasanta Chandra Mahalanobis
tenure from: 1931
tenure till: 1972

emp27
type: NamedIndividual
type: Employment
job title: UniversityLibrarian
employed at: Banaras Hindu University
tenure from: 1960
tenure till: 1971

emp28
type: NamedIndividual
type: Employment
job title: ChiefLibrarian
employed at: DanishRoyalLibrary
tenure from: 1943
tenure till: 1952

emp29
type: NamedIndividual
type: Employment
job title: ResearchAssistant
employed at: Eidgenössische Technische Hochschule Zürich
tenure from: 1956
tenure till: 1958

emp31
type: NamedIndividual
type: Employment
job title: Professor
employed at: Indian Statistical Institute
tenure from: 1962
tenure till: 1984

m01
type: NamedIndividual
type: Marriage
has female partner: Seethalakshmi Ayyar
has male partner: Ramamrita Ayyar
marriage till: 1898

m02
type: NamedIndividual
type: Marriage
followed by: m03
has female partner: Rukhmani
has male partner: Shiyali Ramamrita Ranganathan Ayyar
description: They were engaged in 1907
marriage till: 1928
marriage year: 1916

m03
type: NamedIndividual
type: Marriage
has female partner: Vangal Lakshmana Sarada
has male partner: Shiyali Ramamrita Ranganathan Ayyar
marriage till: 1972
marriage year: 1929

m04
type: NamedIndividual
type: Marriage
has female partner: Christine Chomé
has male partner: Triplicaine Ranganathan Yogeshwar
marriage year: 1957

Curzon & Co.
type: NamedIndividual
type: Commercial organization
contained in place: Madras

dog
type: NamedIndividual
type: Pet
is pet of: Shiyali Ramamrita Ranganathan Ayyar
nickname: Blackie
description: During his stay in Delhi, Ranganathan adopted a pet named Blackie.
comment: domestic animal
comment: domestic dog

house cat
type: NamedIndividual
type: Pet
is pet of: Shiyali Ramamrita Ranganathan Ayyar
description: While in Madras, a pet cat was present in Ranganathan's house.
comment: cat
comment: domesticated feline

Tilaka
type: NamedIndividual
type: Decorative Mark
description: Crescent mark of sandalwood paste applied on forehead.
comment: Any mark made with paste or powder on the forehead otherwise other part of the body for religious, spiritual or similar reasons

comment
comment: rdfs:comment is an instance of rdf:Property that may be used to provide a human-readable description of a resource.