description
type: AnnotationProperty
range: string
domain: Thing
type: DatatypeProperty
relation: http://omv.ontoware.org/2005/05/ontology#description
relation: http://schema.org/description
relation: http://usefulinc.com/ns/doap/description
description: An account of the resource.
derived from: http://www.isibang.ac.in/ns/mod/1.0
imported on: 2018-04-25T00:00:00+00:00

comes from the same domain
type: ObjectProperty
domain: Ontology
range: Ontology
description: If the two ontologies come from the same domain (without any other details).
derived from: http://www.isibang.ac.in/ns/mod/1.4
imported on: 2018-04-25T00:00:00+00:00

has disparate modelling
type: ObjectProperty
domain: Ontology
range: Ontology
description: Disagreements related to the conceptualization of the ontologies. Two ontologies are considered to have disparate modeling if they represent corresponding entities in different ways, e.g. as an instance in one case and a class in the other.
derived from: http://www.isibang.ac.in/ns/mod/1.4
imported on: 2018-04-25T00:00:00+00:00

ontology related to
type: ObjectProperty
domain: Ontology
range: Ontology
description: An ontology is related to another if one of the DOOR relations is satisfied.
derived from: http://www.isibang.ac.in/ns/mod/1.2
imported on: 2018-04-25T00:00:00+00:00

conforms to knowledge representation paradigm
type: ObjectProperty
domain: Ontology
range: Knowledge representation paradigm
relation: dc:relation
relation: http://www.isibang.ac.in/ns/mod/1.1/KnowledgeRepresentationFormalism
description: A representation formalism that is followed to describe knowledge in an ontology. Example includes description logics, first order logic, etc. dct: An established standard to which the described resource conforms.
derived from: http://www.isibang.ac.in/ns/mod/1.2
imported on: 2018-04-25T00:00:00+00:00

endorsed by
type: ObjectProperty
domain: Ontology
range: Agent
relation: http://www.isibang.ac.in/ns/mod/1.1/endorsedBy
description: The parties that have expressed support or approval to this ontology.
derived from: http://www.isibang.ac.in/ns/mod/1.2
imported on: 2018-04-25T00:00:00+00:00

has formality level
type: ObjectProperty
domain: Ontology
range: Formality level
relation: http://www.isibang.ac.in/ns/mod/1.0/formalityLevel
description: The level of formality of an ontology.
derived from: http://www.isibang.ac.in/ns/mod/1.2
imported on: 2018-04-25T00:00:00+00:00

has ontology language
type: ObjectProperty
domain: Ontology
range: Ontology language
relation: http://schema.org/fileFormat
relation: http://www.isibang.ac.in/ns/mod/1.1/ontologyDesignLanguage
description: A language that is used to create an ontology.
derived from: http://www.isibang.ac.in/ns/mod/1.2
imported on: 2018-04-25T00:00:00+00:00

has ontology syntax
type: ObjectProperty
domain: Ontology
range: Ontology syntax
relation: http://purl.org/dc/elements/1.1/format
relation: http://purl.org/dc/terms/format
description: The syntax followed in the creation of an ontology.
derived from: http://www.isibang.ac.in/ns/mod/1.2
imported on: 2018-04-25T00:00:00+00:00

is of type
type: ObjectProperty
domain: Ontology
range: Ontology type
relation: http://purl.org/dc/elements/1.1/type
relation: http://www.w3.org/ns/dcat#type
description: The nature of the content of the ontology.
derived from: http://www.isibang.ac.in/ns/mod/1.2
imported on: 2018-04-25T00:00:00+00:00

used ontology engineering methodology
type: ObjectProperty
domain: Ontology
range: Ontology engineering methodology
relation: http://schema.org/publishingPrinciples
relation: http://www.isibang.ac.in/ns/mod/1.1/methodologyUsed
relation: http://www.w3.org/ns/adms#representationTechnique
description: A methodolgy follwoing which an ontology is created.
derived from: http://www.isibang.ac.in/ns/mod/1.2
imported on: 2018-04-25T00:00:00+00:00

used ontology engineering tool
type: ObjectProperty
domain: Ontology
range: Ontology engineering tool
relation: http://purl.org/pav/createdWith
relation: http://www.geneontology.org/formats/oboInOwl#auto-generated-by
relation: http://www.isibang.ac.in/ns/mod/1.1/toolUsed
description: The tool used for the creation of an ontology.
derived from: http://www.isibang.ac.in/ns/mod/1.2
imported on: 2018-04-25T00:00:00+00:00

license
type: ObjectProperty
domain: Ontology
range: License document
relation: http://creativecommons.org/ns#license
relation: http://omv.ontoware.org/2005/05/ontology#hasLicense
relation: http://purl.org/dc/elements/1.1/rights
relation: http://purl.org/dc/terms/license
relation: http://purl.org/dc/terms/rights
relation: http://schema.org/license
description: A legal document giving official permission to do something with the resource.
derived from: http://www.isibang.ac.in/ns/mod/1.0
imported on: 2018-04-25T00:00:00+00:00

access rights
type: ObjectProperty
domain: Ontology
range: Rights Statement
relation: mod:accessibility (defined in mod1.0)
relation: http://www.isibang.ac.in/ns/mod/1.1/accessibility
description: Information about who can access the resource or an indication of its security status.
derived from: http://www.isibang.ac.in/ns/mod/1.2
imported on: 2018-04-25T00:00:00+00:00

accrual method
type: ObjectProperty
domain: Ontology
range: Method of accrual
description: The method by which items are added to a collection.
derived from: http://www.isibang.ac.in/ns/mod/1.2
imported on: 2018-04-25T00:00:00+00:00

accrual periodicity
type: ObjectProperty
domain: Ontology
range: Frequency
relation: http://w3id.org/nkos#updateFrequency
description: The frequency with which items are added to a collection.
derived from: http://www.isibang.ac.in/ns/mod/1.2
imported on: 2018-04-25T00:00:00+00:00

accrual policy
type: ObjectProperty
domain: Ontology
range: Policy
description: The policy governing the addition of items to a collection.
derived from: http://www.isibang.ac.in/ns/mod/1.2
imported on: 2018-04-25T00:00:00+00:00

audience
type: ObjectProperty
domain: Ontology
range: Agent
relation: http://schema.org/audience
relation: http://usefulinc.com/ns/doap#audience
description: A class of entity for whom the resource is intended or useful.
derived from: http://www.isibang.ac.in/ns/mod/1.2
imported on: 2018-04-25T00:00:00+00:00

contributor
type: ObjectProperty
domain: Ontology
range: Agent
relation: http://omv.ontoware.org/2005/05/ontology#hasContributor
relation: http://purl.org/pav/contributedBy
relation: http://schema.org/contributor
relation: http://usefulinc.com/ns/doap#developer
relation: http://usefulinc.com/ns/doap#helper
relation: http://www.geneontology.org/formats/oboInOwl#saved-by
relation: http://www.geneontology.org/formats/oboInOwl#savedBy
description: An entity responsible for making contributions to the resource.
derived from: http://www.isibang.ac.in/ns/mod/1.0
imported on: 2018-04-25T00:00:00+00:00

creator
type: ObjectProperty
domain: Ontology
relation: http://omv.ontoware.org/2005/05/ontology#hasCreator
relation: http://purl.org/pav/authoredBy
relation: http://purl.org/pav/createdBy
relation: http://schema.org/author
relation: http://usefulinc.com/ns/doap#maintainer
relation: http://www.w3.org/ns/prov#wasAttributedTo
relation: http://xmlns.com/foaf/0.1/maker
description: An entity primarily responsible for making the resource.
derived from: http://www.isibang.ac.in/ns/mod/1.0
imported on: 2018-04-25T00:00:00+00:00

has part
type: ObjectProperty
sub property of: relation
inverse of: is part of
relation: http://schema.org/hasPart
relation: http://www.geneontology.org/formats/oboInOwl#hasSubset
relation: http://www.w3.org/ns/adms#sample
description: A related resource that is included either physically or logically in the described resource.
derived from: http://www.isibang.ac.in/ns/mod/1.0
imported on: 2018-04-25T00:00:00+00:00

is part of
type: ObjectProperty
sub property of: relation
domain: Ontology
range: Ontology
relation: http://kannel.open.ac.uk/ontology#semanticallyIncludedIn
relation: http://rdfs.org/ns/void#subset
relation: http://schema.org/isPartOf
relation: http://www.isibang.ac.in/ns/mod/1.1/module
description: A related resource in which the described resource is physically or logically included.
derived from: http://www.isibang.ac.in/ns/mod/1.0
imported on: 2018-04-25T00:00:00+00:00

publisher
type: ObjectProperty
domain: Ontology
range: Organization
relation: http://purl.org/dc/elements/1.1/publisher
relation: http://schema.org/publisher
relation: http://www.w3.org/ns/adms#schemaAgency
description: An entity responsible for making the resource available.
derived from: http://www.isibang.ac.in/ns/mod/1.0
imported on: 2018-04-25T00:00:00+00:00

relation
type: ObjectProperty
domain: Ontology
range: Ontology
relation: ontology related to
relation: http://purl.org/dc/elements/1.1/relation
relation: http://purl.org/vocommons/voaf#reliesOn
description: A related resource.
derived from: http://www.isibang.ac.in/ns/mod/1.0
imported on: 2018-04-25T00:00:00+00:00

rights holder
type: ObjectProperty
domain: Thing
range: Agent
relation: http://schema.org/copyrightHolder
relation: http://www.w3.org/ns/dcat#contactPoint
description: A person or organization owning or managing rights over the resource.
derived from: http://www.isibang.ac.in/ns/mod/1.2
imported on: 2018-04-25T00:00:00+00:00

curated by
type: ObjectProperty
domain: Ontology
range: Person
description: A curator who restructure the previously authored content and shape it to be appropriate for the intended representation (e.g. by normalizing the fields for being represented in a spreadsheet).
derived from: http://www.isibang.ac.in/ns/mod/1.2
imported on: 2018-04-25T00:00:00+00:00

generalizes
type: ObjectProperty
domain: Ontology
range: Ontology
description: Indicates that the subject vocabulary generalizes by some superclasses or superproperties the object vocabulary.
derived from: http://www.isibang.ac.in/ns/mod/1.4
imported on: 2018-04-25T00:00:00+00:00

has disjunctions with
type: ObjectProperty
domain: Ontology
range: Ontology
description: Indicates that the subject vocabulary declares some disjunct classes with the object vocabulary.
derived from: http://www.isibang.ac.in/ns/mod/1.4
imported on: 2018-04-25T00:00:00+00:00

has equivalences with
type: ObjectProperty
domain: Ontology
range: Ontology
relation: http://kannel.open.ac.uk/ontology#isAlignedTo
relation: http://w3id.org/nkos#alignedWith
description: Indicates that the subject vocabulary declares some equivalent classes or properties with the object vocabulary.
derived from: http://www.isibang.ac.in/ns/mod/1.4
imported on: 2018-04-25T00:00:00+00:00

similar
type: ObjectProperty
domain: Ontology
range: Ontology
relation: http://kannel.open.ac.uk/ontology#similarTo
description: Used to assert that two vocabularies are similar in scope and objectives, independently of the fact that they otherwise refer to each other.
derived from: http://www.isibang.ac.in/ns/mod/1.4
imported on: 2018-04-25T00:00:00+00:00

used by
type: ObjectProperty
domain: Ontology
range: Ontology
relation: http://w3id.org/nkos#usedBy
description: Indicates that the subject vocabulary is used by the object vocabulary.
derived from: http://www.isibang.ac.in/ns/mod/1.4
imported on: 2018-04-25T00:00:00+00:00

comment
type: ObjectProperty
domain: Ontology
range: Comment
description: Comments, typically from users.
derived from: http://www.isibang.ac.in/ns/mod/1.4
imported on: 2018-04-25T00:00:00+00:00

translation of work
type: ObjectProperty
domain: Ontology
range: Ontology
relation: http://www.w3.org/ns/adms#translation
description: A work that is a translation of the content of this work.
derived from: http://www.isibang.ac.in/ns/mod/1.4
imported on: 2018-04-25T00:00:00+00:00

translator
type: ObjectProperty
domain: Ontology
range: Agent
description: Organization or person who adapts a creative work to different languages, regional differences and technical requirements of a target market, or that translates during some event.
derived from: http://www.isibang.ac.in/ns/mod/1.4
imported on: 2018-04-25T00:00:00+00:00

analytics
type: ObjectProperty
domain: Ontology
range: analytics
description: Number of visits an ontology received.
derived from: http://www.isibang.ac.in/ns/mod/1.4
imported on: 2018-04-25T00:00:00+00:00

evaluation author
type: ObjectProperty
domain: Evaluation
range: Agent
description: An agent that have participated in an evaluation.
derived from: http://www.isibang.ac.in/ns/mod/1.1
imported on: 2018-04-25T00:00:00+00:00

evaluation based on criteria
type: ObjectProperty
domain: Evaluation
range: Evaluation criteria
description: This property makes a relationship between an evaluation and the evaluation criteria(s)/aspect(s) considered to judge the quality of an ontology (e.g., accuracy, adaptability, clarity, completeness, computation efficiency, conciseness, organizational fitness).
derived from: http://www.isibang.ac.in/ns/mod/1.1
imported on: 2018-04-25T00:00:00+00:00

evaluation method
type: ObjectProperty
domain: Evaluation
range: Evaluation method
description: The method that is followed in evaluating an ontology (e.g., application based approach, assessment by human, data driven approach and golden standard). This property makes a relationship between an ontology and the methodology followed in evaluating the ontology.
derived from: http://www.isibang.ac.in/ns/mod/1.1
imported on: 2018-04-25T00:00:00+00:00

group
type: ObjectProperty
domain: Ontology
range: Group
description: A group of ontologies that the ontology is usually considered into.
derived from: http://www.isibang.ac.in/ns/mod/1.2
imported on: 2018-04-25T00:00:00+00:00

has evaluation
type: ObjectProperty
domain: Ontology
range: Evaluation
relation: http://schema.org/review
description: An ontology that has been evaluated by an agent.
derived from: http://www.isibang.ac.in/ns/mod/1.0
imported on: 2018-04-25T00:00:00+00:00

ontology in use
type: ObjectProperty
domain: Ontology
range: Project
relation: http://www.isibang.ac.in/ns/mod/1.1/ontologyInUse
description: An ontology that is used in a project.
derived from: http://www.isibang.ac.in/ns/mod/1.0
imported on: 2018-04-25T00:00:00+00:00

backward compatible with
type: ObjectProperty
domain: Ontology
range: Ontology
relation: http://kannel.open.ac.uk/ontology#backwardCompatibleWith
relation: http://omv.ontoware.org/2005/05/ontology#isBackwardCompatibleWith
description: This identifies the specified ontology as a prior version of the containing ontology, and further indicates that it is backward compatible with it.
derived from: http://www.isibang.ac.in/ns/mod/1.2
imported on: 2018-04-25T00:00:00+00:00

incompatible with
type: ObjectProperty
domain: Ontology
range: Ontology
relation: http://kannel.open.ac.uk/ontology#owlIncompatibleWith
relation: http://omv.ontoware.org/2005/05/ontology#isIncompatibleWith
description: This indicates that the containing ontology is a later version of the referenced ontology, but is not backward compatible with it.
derived from: http://www.isibang.ac.in/ns/mod/1.2
imported on: 2018-04-25T00:00:00+00:00

generalization of
type: ObjectProperty
sub property of: ontology related to
inverse of: specialization of
derived from: http://www.isibang.ac.in/ns/mod/1.2
imported on: 2018-04-25T00:00:00+00:00

specialization of
type: ObjectProperty
sub property of: ontology related to
relation: http://kannel.open.ac.uk/ontology#explanationEvolution
relation: http://purl.org/vocommons/voaf#specializes
description: An entity that is a specialization of another shares all aspects of the latter, and additionally presents more specific aspects of the same thing as the latter.
derived from: http://www.isibang.ac.in/ns/mod/1.2
imported on: 2018-04-25T00:00:00+00:00

was generated by
type: ObjectProperty
domain: Ontology
range: Activity
description: Generation is the completion of production of a new entity by an activity. This entity did not exist before generation and becomes available for usage after this generation.
derived from: http://www.isibang.ac.in/ns/mod/1.2
imported on: 2018-04-25T00:00:00+00:00

was invalidated by
type: ObjectProperty
domain: Ontology
range: Activity
description: Invalidation is the start of the destruction, cessation, or expiry of an existing entity by an activity. The entity is no longer available for use (or further invalidation) after invalidation. Any generation or usage of an entity precedes its invalidation.
derived from: http://www.isibang.ac.in/ns/mod/1.2
imported on: 2018-04-25T00:00:00+00:00

funded by
type: ObjectProperty
domain: Ontology
range: Agent
relation: http://schema.org/sourceOrganization
relation: http://www.isibang.ac.in/ns/mod/1.0/sponsoredBy
description: An ontology that is sponsored by and developed under a project.
derived from: http://www.isibang.ac.in/ns/mod/1.0
imported on: 2018-04-25T00:00:00+00:00

more permissions
type: DatatypeProperty
domain: Ontology
range: string
description: A related resource which describes additional permissions or alternative licenses for a Work which may be available.
derived from: http://www.isibang.ac.in/ns/mod/1.4
imported on: 2018-04-25T00:00:00+00:00

use guidelines
type: DatatypeProperty
domain: Ontology
range: string
description: A related resource which defines non-binding use guidelines for the work.
derived from: http://www.isibang.ac.in/ns/mod/1.4
imported on: 2018-04-25T00:00:00+00:00

example identifier
type: DatatypeProperty
domain: Ontology
range: string
description: An example identifier used by one item (or record) from a dataset.
derived from: http://www.isibang.ac.in/ns/mod/1.4
imported on: 2018-04-25T00:00:00+00:00

acronym
type: DatatypeProperty
range: string
relation: http://www.isibang.ac.in/ns/mod/1.1/acronym
description: A short name by which an ontology is formally known.
derived from: http://www.isibang.ac.in/ns/mod/1.2
imported on: 2018-04-25T00:00:00+00:00

designed for ontology task
type: DatatypeProperty
domain: Ontology
range: string
description: The purpose for which the ontology was originally designed.
derived from: http://www.isibang.ac.in/ns/mod/1.2
imported on: 2018-04-25T00:00:00+00:00

key classes
type: DatatypeProperty
domain: Ontology
range: string
relation: http://rdfs.org/ns/void#exampleResource
relation: http://schema.org/mainEntity
relation: http://xmlns.com/foaf/0.1/primaryTopic
description: Representative classes in the ontology.
derived from: http://www.isibang.ac.in/ns/mod/1.2
imported on: 2018-04-25T00:00:00+00:00

keywords
type: DatatypeProperty
domain: Ontology
range: string
relation: http://schema.org/keywords
relation: http://www.isibang.ac.in/ns/mod/1.1/keyword
relation: http://www.w3.org/ns/dcat#keyword
description: A keyword(s) is used to describe the content of an ontology.
derived from: http://www.isibang.ac.in/ns/mod/1.2
imported on: 2018-04-25T00:00:00+00:00

known usage
type: DatatypeProperty
domain: Ontology
range: string
description: The applications where the ontology is being used.
derived from: http://www.isibang.ac.in/ns/mod/1.2
imported on: 2018-04-25T00:00:00+00:00

number of axioms
type: DatatypeProperty
sub property of: metrics
domain: Ontology
range: nonNegativeInteger
relation: http://rdfs.org/ns/void#triples
relation: http://www.isibang.ac.in/ns/mod/1.1/noOfAxioms
description: The total number of axioms in an ontology.
derived from: http://www.isibang.ac.in/ns/mod/1.2
imported on: 2018-04-25T00:00:00+00:00

number of classes
type: DatatypeProperty
sub property of: metrics
domain: Ontology
range: nonNegativeInteger
relation: http://purl.org/vocommons/voaf#classNumber
relation: http://rdfs.org/ns/void#classes
relation: http://www.isibang.ac.in/ns/mod/1.1/noOfClasses
description: The total number of classes in an ontology.
derived from: http://www.isibang.ac.in/ns/mod/1.2
imported on: 2018-04-25T00:00:00+00:00

number of individuals
type: DatatypeProperty
sub property of: metrics
domain: Ontology
range: nonNegativeInteger
relation: http://rdfs.org/ns/void#entities
relation: http://www.isibang.ac.in/ns/mod/1.1/noOfIndividuals
description: The total number of individuals in an ontology.
derived from: http://www.isibang.ac.in/ns/mod/1.2
imported on: 2018-04-25T00:00:00+00:00

number of properties
type: DatatypeProperty
sub property of: metrics
domain: Ontology
relation: http://purl.org/vocommons/voaf#propertyNumber
relation: http://rdfs.org/ns/void#properties
relation: http://www.isibang.ac.in/ns/mod/1.1/noOfProperties
description: The total number of properties in an ontology.
derived from: http://www.isibang.ac.in/ns/mod/1.2
imported on: 2018-04-25T00:00:00+00:00

resource locator
type: DatatypeProperty
domain: Ontology
range: anyURI
relation: http://usefulinc.com/ns/doap/download-page
description: The location where the ontology can be found. It should be accessible via a URL. It can be the same as the value for URI property.
derived from: http://www.isibang.ac.in/ns/mod/1.2
imported on: 2018-04-25T00:00:00+00:00

status
type: DatatypeProperty
domain: Ontology
range: string
relation: http://identifiers.org/idot/state
relation: http://www.isibang.ac.in/ns/mod/1.1/status
relation: https://www.w3.org/TR/vocab-adms/#adms-status
description: The tracking information for the contents of the ontology.
derived from: http://www.isibang.ac.in/ns/mod/1.2
imported on: 2018-04-25T00:00:00+00:00

title
type: DatatypeProperty
domain: Ontology
range: string
relation: http://creativecommons.org/ns#attributionName
relation: http://omv.ontoware.org/2005/05/ontology#name
relation: http://schema.org/name
relation: http://www.w3.org/2004/02/skos/core#prefLabel
relation: name
description: A name given to the resource.
derived from: http://www.isibang.ac.in/ns/mod/1.2
imported on: 2018-04-25T00:00:00+00:00

abstract
type: DatatypeProperty
domain: Ontology
range: string
description: A summary of the resource.
derived from: http://www.isibang.ac.in/ns/mod/1.2
imported on: 2018-04-25T00:00:00+00:00

alternative title
type: DatatypeProperty
domain: Ontology
range: string
relation: http://identifiers.org/idot/alternatePrefix
relation: http://schema.org/alternateName
relation: http://www.w3.org/2004/02/skos/core#altLabel
description: An alternative name for the resource.
derived from: http://www.isibang.ac.in/ns/mod/1.2
imported on: 2018-04-25T00:00:00+00:00

bibliographic citation
type: DatatypeProperty
domain: Ontology
range: string
relation: http://omv.ontoware.org/2005/05/ontology#reference
relation: http://xmlns.com/foaf/0.1/isPrimaryTopicOf
relation: https://schema.org/citation
description: A bibliographic reference for the resource.
derived from: http://www.isibang.ac.in/ns/mod/1.2
imported on: 2018-04-25T00:00:00+00:00

coverage
type: DatatypeProperty
domain: Ontology
range: string
relation: http://purl.org/dc/elements/1.1/coverage
relation: http://schema.org/spatial
description: The spatial or temporal topic of the resource, the spatial applicability of the resource, or the jurisdiction under which the resource is relevant.
derived from: http://www.isibang.ac.in/ns/mod/1.2
imported on: 2018-04-25T00:00:00+00:00

date created
type: DatatypeProperty
sub property of: date
domain: Ontology
range: dateTime
relation: http://omv.ontoware.org/2005/05/ontology#creationDate
relation: http://purl.org/dc/elements/1.1/date
relation: date
relation: http://purl.org/pav/authoredOn
relation: http://purl.org/pav/contributedOn
relation: http://purl.org/pav/createdOn
relation: http://schema.org/dateCreated
relation: http://www.geneontology.org/formats/oboInOwl#date
relation: http://www.geneontology.org/formats/oboInOwl#hasDate
relation: http://www.isibang.ac.in/ns/mod/1.1/creationDate
relation: http://www.w3.org/ns/prov#generatedAtTime
description: Date of creation of the resource.
derived from: http://www.isibang.ac.in/ns/mod/1.2
imported on: 2018-04-25T00:00:00+00:00

date
type: DatatypeProperty
description: A point or period of time associated with an event in the lifecycle of the resource.
derived from: http://www.isibang.ac.in/ns/mod/1.0
imported on: 2018-04-25T00:00:00+00:00

date submitted
type: DatatypeProperty
sub property of: date
domain: Ontology
range: dateTime
relation: http://schema.org/datePublished
description: Date of submission of the resource.
derived from: http://www.isibang.ac.in/ns/mod/1.2
imported on: 2018-04-25T00:00:00+00:00

has format
type: DatatypeProperty
domain: Ontology
range: anyURI
description: A related resource that is substantially the same as the pre-existing described resource, but in another format.
derived from: http://www.isibang.ac.in/ns/mod/1.2
imported on: 2018-04-25T00:00:00+00:00

has version
type: DatatypeProperty
domain: Ontology
range: anyURI
relation: http://purl.org/pav/hasVersion
relation: http://www.isibang.ac.in/ns/mod/1.1/version
relation: generalization of
description: A related resource that is a version, edition, or adaptation of the described resource.
derived from: http://www.isibang.ac.in/ns/mod/1.2
imported on: 2018-04-25T00:00:00+00:00

identifier
type: DatatypeProperty
domain: Ontology
range: anyURI
relation: http://purl.org/dc/elements/1.1/identifier
relation: https://www.w3.org/2009/08/skos-reference/skos.html#notation
relation: https://www.w3.org/TR/vocab-adms/#adms-identifier
description: An unambiguous reference to the resource within a given context.
derived from: http://www.isibang.ac.in/ns/mod/1.0
imported on: 2018-04-25T00:00:00+00:00

is format of
type: DatatypeProperty
domain: Ontology
range: anyURI
relation: http://www.isibang.ac.in/ns/mod/1.1/syntax
description: A related resource that is substantially the same as the described resource, but in another format.
derived from: http://www.isibang.ac.in/ns/mod/1.2
imported on: 2018-04-25T00:00:00+00:00

language
type: DatatypeProperty
domain: Ontology
range: anyURI
relation: http://omv.ontoware.org/2005/05/ontology#naturalLanguage
relation: http://purl.org/dc/elements/1.1/language
relation: http://schema.org/inLanguage
relation: http://usefulinc.com/ns/doap/language
description: A language of the resource.
derived from: http://www.isibang.ac.in/ns/mod/1.0
imported on: 2018-04-25T00:00:00+00:00

date modified
type: DatatypeProperty
sub property of: date
domain: Ontology
range: dateTime
relation: http://omv.ontoware.org/2005/05/ontology#modificationDate
relation: http://schema.org/dateModified
relation: http://usefulinc.com/ns/doap#created
description: Date on which the resource was changed.
derived from: http://www.isibang.ac.in/ns/mod/1.2
imported on: 2018-04-25T00:00:00+00:00

source
type: DatatypeProperty
domain: Ontology
range: string
relation: mod:sourceOntology
relation: http://purl.org/dc/elements/1.1/source
relation: http://schema.org/isBasedOn
relation: http://w3id.org/nkos#basedOn
relation: http://www.isibang.ac.in/ns/mod/1.1/sourceOntology
relation: http://www.w3.org/ns/prov#wasDerivedFrom
relation: http://www.w3.org/ns/prov#wasInfluencedBy
description: A related resource from which the described resource is derived.
derived from: http://www.isibang.ac.in/ns/mod/1.2
imported on: 2018-04-25T00:00:00+00:00

subject
type: DatatypeProperty
domain: Ontology
range: string
relation: http://omv.ontoware.org/2005/05/ontology#hasDomain
relation: http://purl.org/dc/elements/1.1/subject
relation: http://schema.org/about
relation: http://www.w3.org/ns/dcat#theme
relation: http://xmlns.com/foaf/0.1/topic
description: The topic of the resource.
derived from: http://www.isibang.ac.in/ns/mod/1.0
imported on: 2018-04-25T00:00:00+00:00

date valid
type: DatatypeProperty
sub property of: date
domain: Ontology
range: dateTime
relation: http://purl.org/pav/lastUpdateOn
relation: http://schema.org/endDate
relation: http://www.w3.org/ns/prov#invalidatedAtTime
description: Date (often a range) of validity of a resource.
derived from: http://www.isibang.ac.in/ns/mod/1.2
imported on: 2018-04-25T00:00:00+00:00

curated on
type: DatatypeProperty
sub property of: date
domain: Ontology
range: dateTime
description: Specifies the date this resource was curated. pav:curatedBy gives the agents that performed the curation.
derived from: http://www.isibang.ac.in/ns/mod/1.2
imported on: 2018-04-25T00:00:00+00:00

changes
type: DatatypeProperty
domain: Ontology
range: anyURI
description: A reference to a resource that describes changes between this version of a vocabulary and the previous.
derived from: http://www.isibang.ac.in/ns/mod/1.2
imported on: 2018-04-25T00:00:00+00:00

example
type: DatatypeProperty
domain: Ontology
range: anyURI
relation: http://schema.org/workExample
description: A reference to a resource that provides an example of how this resource can be used.
derived from: http://www.isibang.ac.in/ns/mod/1.2
imported on: 2018-04-25T00:00:00+00:00

preferred namespace prefix
type: DatatypeProperty
domain: Ontology
range: string
relation: http://identifiers.org/idot/preferredPrefix
relation: http://www.geneontology.org/formats/oboInOwl#default-namespace
relation: http://www.geneontology.org/formats/oboInOwl#hasDefaultNamespace
description: The preferred namespace prefix to use when using terms from this vocabulary in an XML document.
derived from: http://www.isibang.ac.in/ns/mod/1.2
imported on: 2018-04-25T00:00:00+00:00

preferred namespace URI
type: DatatypeProperty
domain: Ontology
range: anyURI
relation: http://rdfs.org/ns/void#uriSpace
description: The preferred namespace URI to use when using terms from this vocabulary in an XML document.
derived from: http://www.isibang.ac.in/ns/mod/1.2
imported on: 2018-04-25T00:00:00+00:00

class partition
type: DatatypeProperty
domain: Ontology
range: anyURI
description: A subset of a void:Dataset that contains only the entities of a certain rdfs:Class.
derived from: http://www.isibang.ac.in/ns/mod/1.4
imported on: 2018-04-25T00:00:00+00:00

data dump
type: DatatypeProperty
domain: Ontology
range: anyURI
relation: http://schema.org/distribution
relation: http://usefulinc.com/ns/doap#download-mirror
description: An RDF dump, partial or complete, of a void:Dataset.
derived from: http://www.isibang.ac.in/ns/mod/1.4
imported on: 2018-04-25T00:00:00+00:00

open search description
type: DatatypeProperty
domain: Ontology
range: anyURI
description: An OpenSearch description document for a free-text search service over a void:Dataset.
derived from: http://www.isibang.ac.in/ns/mod/1.4
imported on: 2018-04-25T00:00:00+00:00

property partition
type: DatatypeProperty
domain: Ontology
range: anyURI
description: A subset of a void:Dataset that contains only the triples of a certain rdf:Property.
derived from: http://www.isibang.ac.in/ns/mod/1.4
imported on: 2018-04-25T00:00:00+00:00

URI lookup endpoint
type: DatatypeProperty
domain: Ontology
range: anyURI
description: A protocol endpoint for simple URI lookups for a void:Dataset.
derived from: http://www.isibang.ac.in/ns/mod/1.4
imported on: 2018-04-25T00:00:00+00:00

URI regex pattern
type: DatatypeProperty
domain: Ontology
range: anyURI
relation: http://identifiers.org/idot/identifierPattern
description: A regular expression that matches the URIs of a void:Dataset's entities.
derived from: http://www.isibang.ac.in/ns/mod/1.4
imported on: 2018-04-25T00:00:00+00:00

associated media
type: DatatypeProperty
domain: Ontology
range: anyURI
description: A media object that encodes this CreativeWork. This property is a synonym for encoding.
derived from: http://www.isibang.ac.in/ns/mod/1.4
imported on: 2018-04-25T00:00:00+00:00

award
type: DatatypeProperty
domain: Ontology
range: string
description: An award won by or for this item.
derived from: http://www.isibang.ac.in/ns/mod/1.4
imported on: 2018-04-25T00:00:00+00:00

included in data catalog
type: DatatypeProperty
domain: Ontology
range: anyURI
description: A data catalog which contains this dataset.
derived from: http://www.isibang.ac.in/ns/mod/1.4
imported on: 2018-04-25T00:00:00+00:00

work translation
type: DatatypeProperty
domain: Ontology
range: anyURI
relation: http://www.isibang.ac.in/ns/mod/1.2/translation
relation: http://www.w3.org/ns/adms#translation
description: A pointer to the translated ontology(ies) for an existing ontology.
derived from: http://www.isibang.ac.in/ns/mod/1.4
imported on: 2018-04-25T00:00:00+00:00

bug database
type: DatatypeProperty
domain: Ontology
range: anyURI
description: Bug tracker for a project.
derived from: http://www.isibang.ac.in/ns/mod/1.2
imported on: 2018-04-25T00:00:00+00:00

mailing list
type: DatatypeProperty
domain: Thing
range: anyURI
description: Mailing list home page or email address.
derived from: http://www.isibang.ac.in/ns/mod/1.2
imported on: 2018-04-25T00:00:00+00:00

repository
type: DatatypeProperty
domain: Ontology
range: anyURI
description: Source code repository.
derived from: http://www.isibang.ac.in/ns/mod/1.2
imported on: 2018-04-25T00:00:00+00:00

address
type: DatatypeProperty
domain: Agent
range: string
derived from: http://www.isibang.ac.in/ns/mod/1.0
imported on: 2018-04-25T00:00:00+00:00

author property
type: DatatypeProperty
domain: Ontology
range: anyURI
description: property used to specify the author of a class (BioPortal definition)
derived from: http://www.isibang.ac.in/ns/mod/1.4
imported on: 2018-04-25T00:00:00+00:00

average child count
type: DatatypeProperty
sub property of: metrics
domain: Ontology
range: nonNegativeInteger
description: Average number of children per class (BioPortal definition)
derived from: http://www.isibang.ac.in/ns/mod/1.4
imported on: 2018-04-25T00:00:00+00:00

browsing ui
type: DatatypeProperty
domain: Ontology
range: anyURI
description: The user interface (URL) where the ontology may be browsed or searched.
derived from: http://www.isibang.ac.in/ns/mod/1.2
imported on: 2018-04-25T00:00:00+00:00

byte size
type: DatatypeProperty
sub property of: metrics
domain: Ontology
range: nonNegativeInteger
description: The byte size of an ontology.
derived from: http://www.isibang.ac.in/ns/mod/1.1
imported on: 2018-04-25T00:00:00+00:00

city
type: DatatypeProperty
sub property of: address
derived from: http://www.isibang.ac.in/ns/mod/1.0
imported on: 2018-04-25T00:00:00+00:00

classes with more than 25 children
type: DatatypeProperty
sub property of: metrics
domain: Ontology
range: nonNegativeInteger
description: Number of classes that have more than 25 direct subclasses (BioPortal definition)
derived from: http://www.isibang.ac.in/ns/mod/1.4
imported on: 2018-04-25T00:00:00+00:00

classes with no definition
type: DatatypeProperty
sub property of: metrics
domain: Ontology
range: nonNegativeInteger
description: List of classes that have no value for the definition property (BioPortal definition). For ontologies in OBO and RRF formats, the property for definition is part of the language. For OWL ontologies, the authors specify this property as part of the ontology metadata (the default is skos:definition).
derived from: http://www.isibang.ac.in/ns/mod/1.4
imported on: 2018-04-25T00:00:00+00:00

classes with one child
type: DatatypeProperty
sub property of: metrics
domain: Ontology
range: nonNegativeInteger
description: Number of classes that have only one subclass in the is-a hierarchy (BioPortal definition)
derived from: http://www.isibang.ac.in/ns/mod/1.4
imported on: 2018-04-25T00:00:00+00:00

competency question
type: DatatypeProperty
domain: Ontology
range: string
relation: http://www.isibang.ac.in/ns/mod/1.1/competencyQuestion
description: A set of questions made to build an ontology at the design time.
derived from: http://www.isibang.ac.in/ns/mod/1.0
imported on: 2018-04-25T00:00:00+00:00

definition property
type: DatatypeProperty
domain: Ontology
range: anyURI
description: property used to specify the definition of a class (BioPortal definition)
derived from: http://www.isibang.ac.in/ns/mod/1.4
imported on: 2018-04-25T00:00:00+00:00

evaluation on
type: DatatypeProperty
sub property of: date
domain: Evaluation
range: dateTime
description: The evaluation date of an ontology.
derived from: http://www.isibang.ac.in/ns/mod/1.4
imported on: 2018-04-25T00:00:00+00:00

hierarchy property
type: DatatypeProperty
domain: Ontology
range: anyURI
description: A property that is used to specify the hierarchy (e.g. rdfs:subClassOf or skos:broader)
derived from: http://www.isibang.ac.in/ns/mod/1.4
imported on: 2018-04-25T00:00:00+00:00

max child count
type: DatatypeProperty
sub property of: metrics
domain: Ontology
range: nonNegativeInteger
description: Maximum number of children per class (BioPortal definition)
derived from: http://www.isibang.ac.in/ns/mod/1.4
imported on: 2018-04-25T00:00:00+00:00

max depth
type: DatatypeProperty
sub property of: metrics
domain: Ontology
range: nonNegativeInteger
description: Maximum depth of the hierarchy tree (BioPortal definition)
derived from: http://www.isibang.ac.in/ns/mod/1.4
imported on: 2018-04-25T00:00:00+00:00

metrics
type: DatatypeProperty
description: A generic property to store any metrics related to the ontology.
derived from: http://www.isibang.ac.in/ns/mod/1.4
imported on: 2018-04-25T00:00:00+00:00

Number Of Data Properties
type: DatatypeProperty
sub property of: number of properties
range: nonNegativeInteger
description: The total number of data properties in an ontology.
derived from: http://www.isibang.ac.in/ns/mod/1.2
imported on: 2018-04-25T00:00:00+00:00

number of labels
type: DatatypeProperty
sub property of: number of properties
domain: Ontology
range: nonNegativeInteger
relation: http://www.isibang.ac.in/ns/mod/1.1/numberOfLabels
description: Number of defined labels for any resources in an ontology (classes, properties, etc).
derived from: http://www.isibang.ac.in/ns/mod/1.0
imported on: 2018-04-25T00:00:00+00:00

Number Of Object Properties
type: DatatypeProperty
sub property of: number of properties
range: nonNegativeInteger
description: The total number of object properties in an ontology.
derived from: http://www.isibang.ac.in/ns/mod/1.2
imported on: 2018-04-25T00:00:00+00:00

obsolete parent
type: DatatypeProperty
domain: Ontology
range: anyURI
description: property used to specify the root of an obsolete branch in the ontology
derived from: http://www.isibang.ac.in/ns/mod/1.4
imported on: 2018-04-25T00:00:00+00:00

obsolete property
type: DatatypeProperty
domain: Ontology
range: anyURI
description: property used to specify an obsolete class
derived from: http://www.isibang.ac.in/ns/mod/1.4
imported on: 2018-04-25T00:00:00+00:00

postal code
type: DatatypeProperty
sub property of: address
derived from: http://www.isibang.ac.in/ns/mod/1.0
imported on: 2018-04-25T00:00:00+00:00

pref label property
type: DatatypeProperty
domain: Ontology
range: anyURI
description: property used to specify preferred name (BioPortal definition)
derived from: http://www.isibang.ac.in/ns/mod/1.4
imported on: 2018-04-25T00:00:00+00:00

root classes
type: DatatypeProperty
domain: Ontology
range: anyURI
relation: http://rdfs.org/ns/void#rootResource
relation: http://www.w3.org/2004/02/skos/core#hasTopConcept
description: This property is to provide the root class(es) of an ontology. This is automatically populated by taking the direct subclasses of owl:Thing If the ontology is also defined as a unique skos:ConceptScheme, then this property should become equivalent of skos:hasTopConcept
derived from: http://www.isibang.ac.in/ns/mod/1.2
imported on: 2018-04-25T00:00:00+00:00

sample queries
type: DatatypeProperty
domain: Ontology
range: string
description: A set of queries (may be SPARQL, DL Queries) that are provided along with an ontology.
derived from: http://www.isibang.ac.in/ns/mod/1.0
imported on: 2018-04-25T00:00:00+00:00

state
type: DatatypeProperty
sub property of: address
derived from: http://www.isibang.ac.in/ns/mod/1.0
imported on: 2018-04-25T00:00:00+00:00

street address
type: DatatypeProperty
sub property of: address
derived from: http://www.isibang.ac.in/ns/mod/1.0
imported on: 2018-04-25T00:00:00+00:00

synonym property
type: DatatypeProperty
domain: Ontology
range: anyURI
relation: http://www.geneontology.org/formats/oboInOwl#hasSynonymType
relation: http://www.geneontology.org/formats/oboInOwl#synonymtypedef
description: property used to specify synonyms (BioPortal definition)
derived from: http://www.isibang.ac.in/ns/mod/1.4
imported on: 2018-04-25T00:00:00+00:00

vocabulary used
type: DatatypeProperty
domain: Ontology
range: anyURI
relation: http://purl.org/vocommons/voaf#metadataVoc
relation: http://schema.org/schemaVersion
relation: http://www.w3.org/ns/adms#supportedSchema
description: A vocabulary(ies) that is used and/or referred to create the current ontology.
derived from: http://www.isibang.ac.in/ns/mod/1.0
imported on: 2018-04-25T00:00:00+00:00

value
type: DatatypeProperty
domain: analytics
range: string
description: The actual value of the analytics property.
derived from: http://www.isibang.ac.in/ns/mod/1.4
imported on: 2018-04-25T00:00:00+00:00

comment
type: DatatypeProperty
domain: Ontology
range: string
relation: http://omv.ontoware.org/2005/05/ontology#notes
relation: description
relation: http://www.w3.org/ns/adms#versionNotes
description: Is used to provide a human-readable description of a resource.
derived from: http://www.isibang.ac.in/ns/mod/1.2
imported on: 2018-04-25T00:00:00+00:00

deprecated
type: DatatypeProperty
domain: Ontology
range: boolean
relation: http://identifiers.org/idot/obsolete
relation: http://www.isibang.ac.in/ns/mod/1.1/obsolete
description: An annotation with the owl:deprecated annotation property and the value equal to "true"^^xsd:boolean can be used to specify that an IRI is deprecated.
derived from: http://www.isibang.ac.in/ns/mod/1.2
imported on: 2018-04-25T00:00:00+00:00

prior version
type: DatatypeProperty
domain: Ontology
range: anyURI
relation: http://kannel.open.ac.uk/ontology#priorVersion
relation: http://omv.ontoware.org/2005/05/ontology#hasPriorVersion
relation: http://purl.org/dc/terms/isVersionOf
relation: http://www.w3.org/ns/adms#prev
relation: https://www.w3.org/ns/prov#wasRevisionOf
description: This identifies the specified ontology as a prior version of the containing ontology.
derived from: http://www.isibang.ac.in/ns/mod/1.2
imported on: 2018-04-25T00:00:00+00:00

version iri
type: DatatypeProperty
domain: Ontology
range: anyURI
description: The property that identifies the version IRI of an ontology.
derived from: http://www.isibang.ac.in/ns/mod/1.2
imported on: 2018-04-25T00:00:00+00:00

version info
type: DatatypeProperty
domain: Ontology
range: string
relation: http://omv.ontoware.org/2005/05/ontology#version
relation: http://purl.org/pav/version
relation: http://usefulinc.com/ns/doap/release
relation: http://www.geneontology.org/formats/oboInOwl#data-version
relation: http://www.geneontology.org/formats/oboInOwl#hasVersion
relation: http://www.isibang.ac.in/ns/mod/1.1/version
relation: https://schema.org/version
description: The version of the released ontology.
derived from: http://www.isibang.ac.in/ns/mod/1.2
imported on: 2018-04-25T00:00:00+00:00

imports
type: DatatypeProperty
domain: Ontology
range: anyURI
relation: http://omv.ontoware.org/2005/05/ontology#useImports
relation: http://purl.org/dc/terms/requires
relation: http://purl.org/vocommons/voaf#extends
relation: http://rdfs.org/ns/void#vocabulary
description: References to another OWL ontology containing definitions, whose meaning is considered to be part of the meaning of the importing ontology.
derived from: http://www.isibang.ac.in/ns/mod/1.2
imported on: 2018-04-25T00:00:00+00:00

hidden label
type: DatatypeProperty
domain: Thing
range: string
description: Hidden or past name
description: The hidden labels are useful when a user is interacting with a knowledge organization system via a text-based search function. The user may, for example, enter mis-spelled words when trying to find a relevant concept. If the mis-spelled query can be matched against a hidden label, the user will be able to find the relevant concept, but the hidden label won't otherwise be visible to the user (so further mistakes aren't encouraged).
derived from: http://www.isibang.ac.in/ns/mod/1.4
imported on: 2018-04-25T00:00:00+00:00

endpoint
type: DatatypeProperty
domain: Ontology
range: anyURI
relation: http://rdfs.org/ns/void#sparqlEndpoint
description: Relates an instance of sd:Service to a SPARQL endpoint that implements the SPARQL Protocol service for the service. The object of the sd:endpoint property is an IRI.
derived from: http://www.isibang.ac.in/ns/mod/1.2
imported on: 2018-04-25T00:00:00+00:00

depiction
type: DatatypeProperty
domain: Ontology
range: anyURI
relation: http://schema.org/image
relation: http://usefulinc.com/ns/doap#screenshots
description: A depiction of some thing.
derived from: http://www.isibang.ac.in/ns/mod/1.2
imported on: 2018-04-25T00:00:00+00:00

first name
type: DatatypeProperty
domain: Person
range: string
description: The first name of a person.
derived from: http://www.isibang.ac.in/ns/mod/1.0
imported on: 2018-04-25T00:00:00+00:00

homepage
type: DatatypeProperty
domain: Thing
range: anyURI
relation: http://creativecommons.org/ns#attributionURL
relation: http://schema.org/mainEntityOfPage
relation: http://usefulinc.com/ns/doap#blog
relation: http://www.isibang.ac.in/ns/mod/1.1/homepage
description: An unambiguous reference to the resource within a given context.
derived from: http://www.isibang.ac.in/ns/mod/1.0
imported on: 2018-04-25T00:00:00+00:00

last name
type: DatatypeProperty
domain: Agent
range: string
description: The last name of a person.
derived from: http://www.isibang.ac.in/ns/mod/1.0
imported on: 2018-04-25T00:00:00+00:00

logo
type: DatatypeProperty
domain: Ontology
range: anyURI
relation: http://schema.org/logo
description: A logo representing some thing.
derived from: http://www.isibang.ac.in/ns/mod/1.2
imported on: 2018-04-25T00:00:00+00:00

personal mailbox
type: DatatypeProperty
range: anyURI
description: A personal mailbox, ie. an Internet mailbox associated with exactly one owner, the first owner of this mailbox. This is a 'static inverse functional property', in that there is (across time and change) at most one individual that ever has any particular value for foaf:mbox.
derived from: http://www.isibang.ac.in/ns/mod/1.4
imported on: 2018-04-25T00:00:00+00:00

name
type: DatatypeProperty
domain: Thing
range: string
description: A name for some thing.
derived from: http://www.isibang.ac.in/ns/mod/1.0
imported on: 2018-04-25T00:00:00+00:00

page
type: DatatypeProperty
domain: Thing
range: anyURI
relation: http://omv.ontoware.org/2005/05/ontology#documentation
relation: http://purl.org/vocab/vann/usageNote
relation: http://usefulinc.com/ns/doap/wiki
relation: http://www.isibang.ac.in/ns/mod/1.1/document
relation: http://www.w3.org/2000/01/rdf-schema#seeAlso
relation: http://www.w3.org/ns/dcat#llandingPage
description: A link to the documentation page on a thing.
derived from: http://www.isibang.ac.in/ns/mod/1.2
imported on: 2018-04-25T00:00:00+00:00

phone
type: DatatypeProperty
domain: Agent
range: string
description: A phone, specified using fully qualified telelephone number.
derived from: http://www.isibang.ac.in/ns/mod/1.0
imported on: 2018-04-25T00:00:00+00:00

ontology iri
type: DatatypeProperty
domain: Ontology
range: anyURI
relation: http://omv.ontoware.org/2005/05/ontology#uri
description: The URI of the ontology which is described by this metadata.
derived from: http://www.isibang.ac.in/ns/mod/1.2
imported on: 2018-04-25T00:00:00+00:00

to do list
type: DatatypeProperty
domain: Ontology
range: string
description: Describes future tasks planned by a resource curator. This property is primarily intended to be used for vocabularies or datasets, but the domain is left open, it can be used for any resource. Use iCalendar Vtodo class and its properties to further describe the task calendar, priorities etc.
derived from: http://www.isibang.ac.in/ns/mod/1.4
imported on: 2018-04-25T00:00:00+00:00

Formality level
type: Class
description: The level of formality of an ontology.
derived from: http://www.isibang.ac.in/ns/mod/1.2
imported on: 2018-04-25T00:00:00+00:00

Knowledge representation paradigm
type: Class
relation: http://purl.org/dc/terms/conformsTo
description: Information about a knowledge representation paradigm a particular language adheres to.
derived from: http://www.isibang.ac.in/ns/mod/1.2
imported on: 2018-04-25T00:00:00+00:00

Ontology engineering methodology
type: Class
description: Information about the ontology engineering methodology.
derived from: http://www.isibang.ac.in/ns/mod/1.2
imported on: 2018-04-25T00:00:00+00:00

Ontology engineering tool
type: Class
description: A tool used to create the ontology.
derived from: http://www.isibang.ac.in/ns/mod/1.2
imported on: 2018-04-25T00:00:00+00:00

Ontology language
type: Class
description: Information about the language in which the ontology is implemented.
derived from: http://www.isibang.ac.in/ns/mod/1.2
imported on: 2018-04-25T00:00:00+00:00

Ontology syntax
type: Class
description: A syntax that is used to implement an ontology. Example includes RDF/XML, Notation3, n-triples, RDFa and Turtle.
derived from: http://www.isibang.ac.in/ns/mod/1.2
imported on: 2018-04-25T00:00:00+00:00

Ontology type
type: Class
description: This class subsumes types of ontologies according to well-known classifications in the Ontology Engineering literature.
derived from: http://www.isibang.ac.in/ns/mod/1.2
imported on: 2018-04-25T00:00:00+00:00

Frequency
type: Class
description: A rate at which something recurs.
derived from: http://www.isibang.ac.in/ns/mod/1.2
imported on: 2018-04-25T00:00:00+00:00

License document
type: Class
subclass of: Rights Statement
description: A legal document giving official permission to do something with a Resource.
derived from: http://www.isibang.ac.in/ns/mod/1.2
imported on: 2018-04-25T00:00:00+00:00

Method of accrual
type: Class
description: A method by which resources are added to a collection.
derived from: http://www.isibang.ac.in/ns/mod/1.2
imported on: 2018-04-25T00:00:00+00:00

Policy
type: Class
description: A plan or course of action by an authority, intended to influence and determine decisions, actions, and other matters.
derived from: http://www.isibang.ac.in/ns/mod/1.2
imported on: 2018-04-25T00:00:00+00:00

Rights Statement
type: Class
description: A statement about the intellectual property rights (IPR) held in or over a Resource, a legal document giving official permission to do something with a resource, or a statement about access rights.
derived from: http://www.isibang.ac.in/ns/mod/1.2
imported on: 2018-04-25T00:00:00+00:00

Comment
type: Class
description: Comments, typically from users.
derived from: http://www.isibang.ac.in/ns/mod/1.4
imported on: 2018-04-25T00:00:00+00:00

analytics
type: Class
description: Number of visits an ontology received.
derived from: http://www.isibang.ac.in/ns/mod/1.4
imported on: 2018-04-25T00:00:00+00:00

Evaluation
type: Class
description: The results of evaluating an ontology. An ontology can have more than one evaluations.
derived from: http://www.isibang.ac.in/ns/mod/1.1
imported on: 2018-04-25T00:00:00+00:00

Evaluation criteria
type: Class
description: The evaluation criterias, essentially the various aspects that are used in validating the quality of an ontology. These aspects may include for example, accuracy, adaptability, accessibility, clarity, completeness, computational efficiency, conciseness, informativeness, uniqueness, relevancy, reliability, usefulness and organizational fitness.
derived from: http://www.isibang.ac.in/ns/mod/1.1
imported on: 2018-04-25T00:00:00+00:00

Evaluation method
type: Class
description: The methodology that is followed in evaluating an ontology, e.g., application based approach, assessment by human, data driven approach and golden standard.
derived from: http://www.isibang.ac.in/ns/mod/1.1
imported on: 2018-04-25T00:00:00+00:00

Group
type: Class
description: A group of ontologies that the ontology is usually considered into.
derived from: http://www.isibang.ac.in/ns/mod/1.2
imported on: 2018-04-25T00:00:00+00:00

Ontology
type: Class
subclass of: Restriction
  on property: conforms to knowledge representation paradigm
  all values from: Knowledge representation paradigm
subclass of: Restriction
  on property: has formality level
  all values from: Formality level
subclass of: Restriction
  on property: has ontology language
  all values from: Ontology language
subclass of: Restriction
  on property: has ontology syntax
  all values from: Ontology syntax
subclass of: Restriction
  on property: used ontology engineering methodology
  all values from: Ontology engineering methodology
subclass of: Restriction
  on property: used ontology engineering tool
  all values from: Ontology engineering tool
subclass of: Restriction
  on property: creator
  all values from: Agent
subclass of: Restriction
  on property: creator
  min qualified cardinality: 1
  on class: Agent
subclass of: Restriction
  on property: has formality level
  max cardinality: 1
subclass of: Restriction
  on property: has ontology syntax
  max cardinality: 1
subclass of: Restriction
  on property: designed for ontology task
  all values from: string
subclass of: Restriction
  on property: key classes
  all values from: string
subclass of: Restriction
  on property: keywords
  all values from: string
subclass of: Restriction
  on property: resource locator
  all values from: anyURI
subclass of: Restriction
  on property: title
  all values from: string
subclass of: Restriction
  on property: date created
  all values from: dateTime
subclass of: Restriction
  on property: language
  all values from: anyURI
subclass of: Restriction
  on property: ontology iri
  all values from: anyURI
subclass of: Restriction
  on property: designed for ontology task
  min cardinality: 1
subclass of: Restriction
  on property: key classes
  min cardinality: 1
subclass of: Restriction
  on property: keywords
  min cardinality: 1
subclass of: Restriction
  on property: title
  min cardinality: 1
subclass of: Restriction
  on property: date created
  cardinality: 1
subclass of: Restriction
  on property: resource locator
  max cardinality: 1
subclass of: Restriction
  on property: ontology iri
  max qualified cardinality: 1
  on data range: anyURI
description: By ontology, we not only refers the OWL structure that respects all the conditions to be referred as a fully formalized ontology but also every ontology like structure that formalizes some knowledge (e.g., thesaurus, taxonomy, metadata vocabulary).
derived from: http://www.isibang.ac.in/ns/mod/1.0
imported on: 2018-04-25T00:00:00+00:00

Activity
type: Class
description: An activity is something that occurs over a period of time and acts upon or with entities; it may include consuming, processing, transforming, modifying, relocating, using, or generating entities.
derived from: http://www.isibang.ac.in/ns/mod/1.2
imported on: 2018-04-25T00:00:00+00:00

Agent
type: Class
description: An agent (eg. person, group, software or physical artifact).
derived from: http://www.isibang.ac.in/ns/mod/1.0
imported on: 2018-04-25T00:00:00+00:00

Organization
type: Class
subclass of: Agent
description: An organization.
derived from: http://www.isibang.ac.in/ns/mod/1.0
imported on: 2018-04-25T00:00:00+00:00

Person
type: Class
subclass of: Agent
description: A person.
derived from: http://www.isibang.ac.in/ns/mod/1.0
imported on: 2018-04-25T00:00:00+00:00

Project
type: Class
description: A project (a collective endeavour of some kind).
derived from: http://www.isibang.ac.in/ns/mod/1.0
imported on: 2018-04-25T00:00:00+00:00