An Ontology for Representation and Publication of COVID-19 Cases and Patient Information
type: Ontology
version IRI: http://w3id.org/codo/1.3
designed for ontology task: This COVID-19 ontology is a data model for publishing COVID-19 data on the Web as a Graph. The primary focuses of the model are: (1) COVID-19 cases: the data for COVID-19 cases (e.g., active, recovered, deceased, migrated) ondaily basis across the geo-location (district, state and country), available resources and requirements; (2) COVID-19 patient data: nationality, symptom, suspected level of covid -19 cases, covid-19 treatment facility, covid-19 clinical facility, patient's travel history, inter-personal relationships between patients, suspected transmission reason, tracking of patient test results, etc.
created: 2020-04-27T10:00:00
creator: Biswanath Dutta (Indian Statistical Institute, India)
creator: Michael DeBellis (Semantic Web Consultant, USA)
license: https://creativecommons.org/licenses/by/4.0/
publisher: Indian Statistical Institute
browsing UI: http://www.isibang.ac.in/ns/codo
competency question: Some example competency questions: How many people recovered from COVId-19 in place p until date t? How many people died in country c? Give me the travel history of patient p? Give me the COVID-19 patients and their relationship, if any. Give me the COVID-19 patients who are in family relationships. Give me the primary reasons for the maximum number of COVID-19 patients. Give me the most prevalent symtopms of Severe COVID-19.

utilityEntity
type: AnnotationProperty
comment: Used to mark any entity (only data properties now) that is meant for processing data but is not part of the deployed model

admitted in
type: ObjectProperty
inverse of: hasAdmittedPatient
domain: Patient
range: COVID-19 dedicated facility
comment: The patient admitted to the covid-19 dedicated facilities, like home, hotel, hospital, etc.

clinical facility
type: ObjectProperty
domain: Disease
range: Medical clinic
comment: The medical clinic where testing/ diagnosis for disease is available.

co-worker
type: ObjectProperty
sub property of: has relationships
type: SymmetricProperty
domain: Person
range: Person
comment: Two persons in co-worker relation.

comorbidity
type: ObjectProperty
sub property of: topObjectProperty
domain: Patient
range: Comorbidity

contained in
type: ObjectProperty
inverse of: contains
type: TransitiveProperty
domain: Class
  union of: Agent
  union of: Place
range: Place
comment: Indicates a place has a place part.

contains
type: ObjectProperty
type: TransitiveProperty
comment: A place is part of another place.

contracted virus from
type: ObjectProperty
inverse of: passedVirusTo
domain: Agent
range: Agent
comment: In case the patient contracted the virus from is known, this property mentions the case number of the "parent" [source: https://www.isibang.ac.in/~athreya/incovid19/data.html]

country wise statistics
type: ObjectProperty
sub property of: has statistics
domain: Country
range: Country wise statistics
comment: A property to connect to the country wise metrics related to the casualities of the disease.

covid-19 clinical facility
type: ObjectProperty
sub property of: clinical facility
domain: Disease caused by Coronaviridae
range: CovidTestingFacility
comment: The medical clinic where testing/ diagnosis for the COVID-19 Coronavirus disease is available.

currentResident
type: ObjectProperty
sub property of: topObjectProperty
inverse of: isCurrentResidentOf
domain: Person
range: Place
comment: The Place (typically a City but could be a building, state, etc.) where a Person currently lives

district wise statistics
type: ObjectProperty
sub property of: has statistics
domain: District
range: District wise statistics
comment: A property to connect to the district wise metrics related to the casualities of the disease.

hasAunt
type: ObjectProperty
sub property of: kinswomen
comment: The sister of your father or mother; the wife of your uncle.

hasBrother
type: ObjectProperty
sub property of: hasSibling
sub property of: kinsman
domain: Person
comment: A male with the same parents as someone else.

has city
type: ObjectProperty
sub property of: contained in
range: City

has country
type: ObjectProperty
sub property of: contained in
range: Country

has diagnosis
type: ObjectProperty
inverse of: is diagnosis of
domain: Patient
range: Diagnosis
comment: The diagnosis details of a patient.

has district
type: ObjectProperty
sub property of: contained in
range: District

domestic help
type: ObjectProperty
sub property of: hasCloseRelationship
inverse of: isDomesticHelpFor
domain: Person
range: Person
comment: A person is a domestic help to anothe person.

hasHusband
type: ObjectProperty
sub property of: spouse
inverse of: hasWife
domain: Woman
range: Man

location
type: ObjectProperty
inverse of: isLocationFor
domain: Class
  union of: Disease
  union of: Agent
range: Place
comment: The location of for example where a person is situated, an organization (covid-19 dedicated facilities, medical clinics) is located, or the geographic coverage of a disease.

hasMember
type: ObjectProperty
inverse of: isMemberOf
domain: Group
range: Agent

hasNeighbor
type: ObjectProperty
sub property of: has relationships

hasNephew
type: ObjectProperty
sub property of: kinsman
comment: A son of your brother or sister.

hasNiece
type: ObjectProperty
sub property of: kinswomen
comment: A daughter of your brother or sister.

province
type: ObjectProperty
sub property of: contained in
range: Province

has relationships
type: ObjectProperty
domain: Person
range: Person
comment: A generic property to store the relationships between persons.

roommate
type: ObjectProperty
sub property of: hasCloseRelationship
type: SymmetricProperty
comment: An associate who shares a room with you.

hasSister
type: ObjectProperty
sub property of: hasSibling
sub property of: kinswomen
comment: A female person who has the same parents as another person.

spouse
type: ObjectProperty
sub property of: hasCloseRelationship
sub property of: hasFamilyMember
type: SymmetricProperty
comment: Two persons in married relationship.

has statistics
type: ObjectProperty
inverse of: is covid-19 statistics of
domain: Place
range: Statistics
comment: A generic property to connect to the metrics related to the casualities of the disease.

has symptom
type: ObjectProperty
domain: Patient
range: Symptom
comment: Any sensation or change in bodily function that is experienced by a patient and is associated with a particular disease.

has test result
type: ObjectProperty
inverse of: is test result for
domain: Patient
range: Test result
comment: A patient has clinical test result.

hasUncle
type: ObjectProperty
sub property of: kinsman
comment: The brother of your father or mother; the husband of your aunt.

has union territory
type: ObjectProperty
sub property of: contained in

hasWife
type: ObjectProperty
sub property of: spouse
domain: Man
range: Woman

is covid-19 statistics of
type: ObjectProperty

is diagnosis of
type: ObjectProperty

isMemberOf
type: ObjectProperty
sub property of: topObjectProperty
domain: Agent
range: Group

is test result for
type: ObjectProperty

kinsman
type: ObjectProperty
sub property of: hasFamilyMember
range: Man
comment: A male relative.

kinswomen
type: ObjectProperty
sub property of: hasFamilyMember
range: Woman
comment: A female relative.

laboratory test finding
type: ObjectProperty
sub property of: has test result
range: Laboratory test finding
comment: Patient's covid-19 clinical test result.

most recent test result
type: ObjectProperty
sub property of: has test result
range: Vital signs
comment: The most recent covid-19 clinical test result.

next test result
type: ObjectProperty
inverse of: previous test result
comment: The next clinical test result of a patient.

permanentResident
type: ObjectProperty
domain: Person
range: Place
comment: The Place (typically a City but could be a building, State, etc.) that a Person has as their permanent home.

previous test result
type: ObjectProperty
domain: Vital signs
range: Vital signs
comment: The previous clinical test result of a patient.

security guard
type: ObjectProperty
sub property of: has relationships
comment: A security guard of a person.

state wise statistics
type: ObjectProperty
sub property of: has statistics
domain: State
range: State wise statistics
comment: A property to connect to the state (province) wise metrics related to the casualities of the disease.

suspected reasons of catching covid-19
type: ObjectProperty
domain: Patient
range: Exposure to COVID-19
comment: The suspected reasons of catching covid-19 disease, for example, travel, attending a marriage anniversary, while treating a patient, infected famility member.

travel history
type: ObjectProperty
sub property of: topObjectProperty
domain: Class
  union of: Exposure to COVID-19
  union of: Person
range: Place
comment: A generic property to store the travel history of a patient. Also used to record the Place that a Patient traveledFrom on ExposureToCovid19 individuals.

travelled from
type: ObjectProperty
sub property of: travel history
range: Place
comment: A suspected covid-19 patient travelled from a place, e.g., country/ state/ district.

travelled to
type: ObjectProperty
sub property of: travel history
range: Place
comment: A suspected covid-19 patient travelled to a place, e.g., country/ state/ district.

has gender
type: ObjectProperty
type: FunctionalProperty
domain: Person
range: Gender type
comment: Gender of a person.

nationality
type: ObjectProperty
domain: Person
range: Country
comment: Nationality of the person.

Blood Pressure (Distolic)
type: DatatypeProperty
sub property of: topDataProperty
type: FunctionalProperty
domain: Vital signs
range: integer

Blood Pressure (Systolic)
type: DatatypeProperty
type: FunctionalProperty
domain: Vital signs
range: integer

peripheral capillary oxygen saturation(SpO2)
type: DatatypeProperty
type: FunctionalProperty
domain: Vital signs
range: integer
comment: The peripheral capillary oxygen saturation, an estimate (in %) of the amount of oxygen in the blood.

acronym
type: DatatypeProperty
range: string
comment: An acronym.

active
type: DatatypeProperty
sub property of: cases
domain: Statistics
range: integer
comment: Number of active covid cases.

admitted on
type: DatatypeProperty
sub property of: date
domain: Patient
range: dateTime
comment: A patient admitted on a particular day and time.
label: date of admission

age
type: DatatypeProperty
type: FunctionalProperty
domain: Person
range: decimal
comment: An age of a person.

area
type: DatatypeProperty
type: FunctionalProperty
domain: Place
range: decimal
comment: Tthe extent of a 2-dimensional surface enclosed within a boundary (in sq. km.).

no. of bed shortage
type: DatatypeProperty
sub property of: resource
domain: Statistics
range: integer
comment: no. of bed shortage.

no. of beds needed
type: DatatypeProperty
sub property of: resource
domain: Statistics
range: integer
comment: no. of beds needed.

cases
type: DatatypeProperty
sub property of: metrics
domain: Statistics
range: integer
comment: Number of covid cases.

country code
type: DatatypeProperty
domain: Country
range: string
comment: The country code. Example, "IND" for India.

covid-19 case on
type: DatatypeProperty
sub property of: date
domain: Statistics
range: dateTime
comment: covid-19 cases on a day

daily increased cases
type: DatatypeProperty
sub property of: cases
domain: Statistics
range: integer
comment: Total no,. of active cases in Date 2 - total no. of active cases in Date 1

date
type: DatatypeProperty
range: dateTime
comment: A particular day specified as the time something happens.

deceased
type: DatatypeProperty
sub property of: cases
domain: Statistics
range: integer
comment: number of deceased covid-19 patients.

diagnosed on
type: DatatypeProperty
sub property of: date
domain: Diagnosis
range: dateTime
comment: The diagnosis took place on a day.
alternative label: tested positive on

district wise patient ID
type: DatatypeProperty
sub property of: case id
type: FunctionalProperty
range: string
comment: The patient ID assigned at the district level (usually a first level of administrative division within a state/ province).

geoName
type: DatatypeProperty
sub property of: topDataProperty
domain: Place
comment: Removed data type xsd:string from range for now. Because I copied the values over from the labels using SPARQL the annotations for the language ("

has caused any secondary infections
type: DatatypeProperty
domain: Patient
range: boolean
comment: This indiicates the the secondary infections caused, if any. The values are either "yes", "no" and indicate if the patient has caused any [known] secondary infections [source: https://www.isibang.ac.in/~athreya/incovid19/data.html].

case id
type: DatatypeProperty
range: string

Heart rate
type: DatatypeProperty
type: FunctionalProperty
domain: Vital signs
range: integer
comment: The rate at which the heart beats; usually measured to obtain a quick evaluation of a person's health.

height
type: DatatypeProperty
type: FunctionalProperty
domain: Person
range: decimal

no. of icu bed shortage
type: DatatypeProperty
sub property of: resource
domain: Statistics
range: integer
comment: no. of icu bed shortage.

no. of icu beds needed
type: DatatypeProperty
sub property of: resource
domain: Statistics
range: integer
comment: no. of invasive ventilators needed.

no. of invasive ventilators needed
type: DatatypeProperty
sub property of: resource
domain: Statistics
range: integer
comment: no. of invasive ventilators needed.

metrics
type: DatatypeProperty
domain: Statistics
comment: A generic property to provide the result related to the covid-19 disease casualties and resources.

noOfPeopleMigrated
type: DatatypeProperty
sub property of: cases
domain: Statistics
range: integer
comment: Number of people migrated after recovery from the covid.
comment: number of people migrated

population density
type: DatatypeProperty
type: FunctionalProperty
domain: Place
range: decimal
comment: For humans, population density is the number of people per unit of area, usually quoted per square kilometre or square mile, and which may include or exclude for example areas of water or glaciers.

recovered
type: DatatypeProperty
sub property of: cases
domain: Statistics
range: integer
comment: Number of people recovered from covid.

date of discharge
type: DatatypeProperty
sub property of: date
domain: Patient
range: dateTime
comment: The patient released on a day from a covid dedicated facility.
alternative label: out date
alternative label: released on

resource
type: DatatypeProperty
sub property of: metrics
domain: Statistics
comment: Available/ required resource for covid treatment.

respiratory rate
type: DatatypeProperty
type: FunctionalProperty
domain: Vital signs
range: integer
comment: Is the number of breaths a person take per minute.

source
type: DatatypeProperty
domain: Statistics
range: Datatype
  union of: anyURI
  union of: string
comment: The data source based on which the statistics produced.

state code
type: DatatypeProperty
domain: State
range: string
comment: State (province) code. Example, "KL" of Kerala.

state wise patient ID
type: DatatypeProperty
sub property of: case id
type: FunctionalProperty
range: string
comment: The patient ID assigned at the state/province level.

temperature
type: DatatypeProperty
type: FunctionalProperty
domain: Vital signs
range: decimal
comment: The body temperature.

test result on
type: DatatypeProperty
sub property of: date
domain: Test result
range: dateTime
comment: The test result date.

weight
type: DatatypeProperty
type: FunctionalProperty
domain: Person
range: decimal
comment: The weight.

name
type: DatatypeProperty
range: string
comment: A name for some thing.

address
type: DatatypeProperty
domain: Class
  union of: Organization
  union of: Person
range: string
comment: Physical address of the item.

address locality
type: DatatypeProperty
sub property of: address
range: string
comment: The locality in which the street address is, and which is in the region. For example, BHEL Layout.

latitude
type: DatatypeProperty
type: FunctionalProperty
domain: Place
range: decimal
comment: The latitude of a location. For example 37.42242

longitude
type: DatatypeProperty
type: FunctionalProperty
domain: Place
range: decimal
comment: The longitude of a location. For example -122.08585.

postal code
type: DatatypeProperty
sub property of: address
range: string
comment: The postal code. For example, 560060

street address
type: DatatypeProperty
sub property of: address
range: string
comment: The street address. For example, 1st Main, Muthurainagara.

Symptom
type: Class
equivalent class: Clinical finding (finding)
comment: A symptom is a perceived change in function, sensation, loss, disturbance or appearance reported by a patient indicative of a disease.
comment: Source: https://www.mohfw.gov.in/pdf/FinalGuidanceonMangaementofCovidcasesversion2.pdf https://www.who.int/news-room/q-a-detail/q-a-coronaviruses

CovidTestingFacility
type: Class
subclass of: Medical clinic
comment: A Medical clinic where testing for the COVID-19 Coronavirus disease is available.
comment: Covid testing facility

Medical clinic
type: Class
subclass of: Organization
comment: A facility, often associated with a hospital or medical school, that is devoted to the specific diagnosis and/or healthcare.

Clinical finding (finding)
type: Class

Anniversary
type: Class
subclass of: Gathering

Business
type: Class
subclass of: Organization

COVID-19 dedicated facility
type: Class
subclass of: Organization
comment: Any facility for providing care to COVID-19 patients.
comment: source: https://www.mohfw.gov.in/pdf/FinalGuidanceonMangaementofCovidcasesversion2.pdf

COVID-19 Diagnosis
type: Class
subclass of: Diagnosis
comment: The diagnosis as COVID-19 patient. The diagnosied COVID-19 patients are categorised to three different categories/cases based on various clinical test and vital signs.

City
type: Class
subclass of: Place
comment: A city.
comment: Towns with population of 1,00,000 and above are called cities.

CityWard
type: Class
subclass of: Place
comment: A ward is a containedIn a city. Calling it CityWard to avoid confusion with a hospital ward.

Close contact
type: Class
subclass of: Exposure to COVID-19
comment: Close contact, a suspected cause for catching COVID-19.

Cluster
type: Class
subclass of: Group
comment: A Cluster is a group of patients with the same disease who are grouped by one or more properties that are considered critical to an analysis of how the disease has spread.

Comorbidity
type: Class
comment: indicate a medical condition existing simultaneously but independently with another condition in a patient (source: Wikipedia)

ContactCluster
type: Class
subclass of: Cluster
comment: A cluster defined by contact with certain individuals. Note that to some extent all clusters are contact clusters so this class is used only for those clusters that specifically mention contact with individuals (or lack of knowledge about such contact) rather than geographic, time, or disease data.

Coronavirus infection
type: Class
subclass of: Disease caused by Coronaviridae
comment: Coronaviruses are a large family of viruses which may cause illness in animals or humans. In humans, several coronaviruses are known to cause respiratory infections ranging from the common cold to more severe diseases such as Middle East Respiratory Syndrome (MERS) and Severe Acute Respiratory Syndrome (SARS). (source: https://www.who.int/news-room/q-a-detail/q-a-coronaviruses)
comment: SCTID: 186747009

Country wise statistics
type: Class
subclass of: Statistics

Covid Care Centre (CCC)
type: Class
subclass of: COVID-19 dedicated facility
comment: Any facility, such as hotels/lodges/hostels/stadiums for providing care to COVID-19 patients are reffered as Covid Care Centre (CCC).

Dedicated Covid Health Centre (DCHC)
type: Class
subclass of: COVID-19 dedicated facility
comment: The Dedicated COVID Health Centre are hospitals that shall offer care for all cases that have been clinically assigned as moderate.

Dedicated Covid Hospital (DCH)
type: Class
subclass of: COVID-19 dedicated facility
comment: The Dedicated COVID Hospitals are hospitals that shall offer comprehensive care primarily for those who have been clinically assigned as severe.

Diagnosed With COVID-19
type: Class
equivalent class: Class
  intersection of: Patient
  intersection of: Restriction
    on property: has diagnosis
    some values from: COVID-19 Diagnosis
subclass of: Patient
comment: A person diagnosed With COVID-19.

Diagnosis
type: Class
comment: SCTID: 439401001
comment: identifying the nature or cause of some phenomenon.

DiagnosisType
type: Class
subclass of: Diagnosis
comment: This models the manner in which a diagnosis was discovered. E.g., via a pregnancy test, screening for a suspected disease, tests done before surgery, etc.

Disease
type: Class
comment: SCTID: 64572001
comment: an impairment of health or a condition of abnormal functioning.

Disease caused by Coronaviridae
type: Class
subclass of: Viral disease
subclass of: Restriction
  on property: covid-19 clinical facility
  some values from: CovidTestingFacility
comment: A viral disease caused by coronavirus.
comment: SCTID: 27619001

DiseaseCluster
type: Class
subclass of: Cluster
comment: Patients clustered by diseases that made them susceptible to the virus

District
type: Class
subclass of: Place
comment: An adminidtrative area spanning regions or counties, several municipalities, subdivisions of municipalities, school district, or political district.

District wise statistics
type: Class
subclass of: Statistics

Doctor
type: Class
subclass of: HealthCareProfessional
comment: A licensed medical doctor.
comment: SCTID: 158965000

Exposure to COVID-19
type: Class
comment: Suspected causes of catching COVID-19.

Gathering
type: Class
subclass of: Exposure to COVID-19
comment: Mass gathering, a suspected cause for catching COVID-19.

GeographicCluster
type: Class
subclass of: Cluster
comment: Patients clustered by the geographic region where they contracted the infection

GeographicRegion
type: Class
subclass of: Place
comment: Geographic regions such as the Middle East, North America, etc. For the cluster class

Group
type: Class
subclass of: Agent

HealthCareProfessional
type: Class
subclass of: Person

InfectedNeighbor
type: Class
subclass of: Exposure to COVID-19

InfectedNephew
type: Class
subclass of: InfectedFamilyMember

InfectedNiece
type: Class
subclass of: InfectedFamilyMember

InfectedViaHealthcareWork
type: Class
subclass of: InfectedViaJob

InfectedViaJob
type: Class
subclass of: Exposure to COVID-19

InfectedViaPoliceWork
type: Class
subclass of: InfectedViaJob

Laboratory test finding
type: Class
equivalent class: Class
  one of: Negative
  one of: Pending
  one of: Positive
subclass of: Test result
comment: SCTID: 118246004
comment: The laboratory test finding of the patient. The possible values are Positive, Negative, Pending.

Man
type: Class
equivalent class: Class
  intersection of: Person
  intersection of: Restriction
    on property: has gender
    has value: Male
subclass of: Person
comment: A man.

Mild and very mild COVID-19
type: Class
subclass of: COVID-19 Diagnosis
comment: Cases presenting with fever and/or upper respiratory tract illness (Influenza Like Illness, ILI).

Moderate COVID-19
type: Class
subclass of: COVID-19 Diagnosis
comment: Pneumonia with no signs of severe disease (Respiratory Rate 15 to 30/minute, SpO2 90%-94%).

Nurse
type: Class
subclass of: HealthCareProfessional
comment: A health professional skilled in caring for young children or the sick (usually under the supervision of a physician).
comment: SCTID: 106292003
label: Professional nurse

PolicePerson
type: Class
subclass of: Person

PreSurgeryTest
type: Class
subclass of: DiagnosisType
comment: The patient was discovered to have another disease as the result of tests given before surgery.

PregnancyScreening
type: Class
subclass of: DiagnosisType
comment: The patient was discovered to have a disease as a result of tests given during pregnancy.

Province
type: Class
subclass of: Place

SecondaryContact
type: Class
subclass of: Exposure to COVID-19

SecurityGuard
type: Class
subclass of: Person

Severe COVID-19
type: Class
subclass of: COVID-19 Diagnosis
comment: Severe Pneumonia (with respiratory rate ≥30/minute and/or SpO2 < 90% in room air) or ARDS or Septic shock.

State wise statistics
type: Class
subclass of: Statistics

Statistics
type: Class
comment: Statistics based on each day.
comment: Statistics of COVID-19 cases which includes the deatils of active, recovered, deaths, and also the resources (e.g., beds required, shortage of beds, ICUs) on daily basis.

Status
type: Class
equivalent class: Class
  one of: Cured
  one of: Deceased
  one of: Hospitalized
comment: The current status of the patient, for example: recovered, hospitalized, deceased.

Test result
type: Class
comment: A test result.

TimeCluster
type: Class
subclass of: Cluster
comment: A cluster defined by some event (including lack of knowledge) at a certain date. Note that clusters are not disjoint, so a cluster can be an instance of a TimeCluster and other clusters.

Town
type: Class
subclass of: Place
comment: Places which satisfy the following criteria are called towns: (i) A minimum population of 5,000; (ii) At least 75 per cent of the male main working population engaged in non-agricultural pursuits; and (iii) A density of population of at least 400 persons per sq. km. (i.e. 1000 per sq. Mile).

UnderTracing
type: Class
subclass of: DiagnosisType
comment: The patient was identified as at risk for the disease (e.g., Covid-19) and was tested as part of tracing people identified to be at risk.

UnionTerritory
type: Class
subclass of: Place
comment: A union territory ('Federally administered territory/province') is a type of administrative division in the Republic of India. Unlike the states of India, which have their own governments, union territories are federal territories governed directly by the Central Government of India.

Untested for COVID-19
type: Class
equivalent class: Class
  intersection of: Person
  intersection of: Restriction
    on property: hadCovidTest
    has value: false
subclass of: Person
comment: Untested for COVID-19

UrgentlyNeedsCovidTest
type: Class
equivalent class: Class
  intersection of: Person
  intersection of: Restriction
    on property: hasCloseRelationship
    some values from: Diagnosed With COVID-19
  intersection of: Restriction
    on property: hadCovidTest
    has value: false
subclass of: Untested for COVID-19
comment: Urgently needs COVID test
comment: Urgently needs COVID-19 test

Viral disease
type: Class
subclass of: Infectious disease
comment: SCTID: 34014006

Vital signs
type: Class
subclass of: Test result
comment: The vital signs of a suspected covid-19 patient as found through clinical tests.

Woman
type: Class
equivalent class: Class
  intersection of: Person
  intersection of: Restriction
    on property: has gender
    has value: Female
subclass of: Person
comment: A women.

Agent
type: Class
comment: An agent (eg. person, group, software or physical artifact).

Organization
type: Class
subclass of: Group
comment: A group of people who work together.

Person
type: Class
subclass of: Agent
comment: A human being.

Country
type: Class
subclass of: Place
comment: A country.

Gender type
type: Class
equivalent class: Class
  one of: Female
  one of: Male
comment: An enumeration of genders.

Infectious disease
type: Class
subclass of: Disease
comment: An infectious disease is a clinically evident human disease resulting from the presence of pathogenic microbial agents, like pathogenic viruses, pathogenic bacteria, fungi, protozoa, multicellular parasites, and prions. To be considered an infectious disease, such pathogens are known to be able to cause this disease.
comment: SCTID: 40733004

Patient
type: Class
subclass of: Person
subclass of: Restriction
  on property: has diagnosis
  some values from: Diagnosis
comment: A patient is any person recipient of health care services.
comment: Patients are categorised into three groups based on the following guidelines. Source: https://www.mohfw.gov.in/pdf/FinalGuidanceonMangaementofCovidcasesversion2.pdf
comment: SCTID: 116154003

Place
type: Class
comment: Entities that have a somewhat fixed, physical extension.

State
type: Class
subclass of: Place
comment: A state or province of a country.

Abu Dhabi
type: NamedIndividual
type: City
type: Place
geoName: Abu Dhabi
latitude: 24.466667
longitude: 54.366667

Generalized aches and pains (finding)
type: NamedIndividual
type: Symptom
type: Clinical finding (finding)
comment: SCTID: 82991003

Acute Respiratory Distress Syndrome (ARDS)
type: NamedIndividual
type: Comorbidity

Ahmedabad
type: NamedIndividual
type: City
type: Place
contained in: Gujarat
contained in: India
has state: Gujarat
geoName: Ahmedabad
latitude: 23.03
longitude: 72.58

Ajmer
type: NamedIndividual
type: City
type: Place
contained in: India
contained in: Rajasthan
has state: Rajasthan
geoName: Ajmer
latitude: 26.4499
longitude: 74.6399

Amsterdam
type: NamedIndividual
type: City
type: Place
contained in: Netherlands
has country: Netherlands
geoName: Amsterdam
latitude: 52.366667
longitude: 4.9

Anantapur
type: NamedIndividual
type: District
type: Place
contained in: Andhra Pradesh
contained in: India
contains: Hindupur
has state: Andhra Pradesh
geoName: Anantapur

Andaman and Nicobar Islands
type: NamedIndividual
type: UnionTerritory
type: Place
contained in: India
has country: India
geoName: Andaman and Nicobar Islands
comment: A union territory of India comprising 572 islands of which 37 are inhabited, are a group of islands at the juncture of the Bay of Bengal and the Andaman Sea.

Andhra Pradesh
type: NamedIndividual
type: Place
type: State
contained in: India
contains: Anantapur
contains: Hindupur
contains: Vishakapatnam
has country: India
geoName: Andhra Pradesh

Argentina
type: NamedIndividual
type: Country
type: Place
geoName: Argentina

Assam
type: NamedIndividual
type: Place
type: State
contained in: India
has country: India
geoName: Assam

Athens
type: NamedIndividual
type: City
type: Place
contained in: Greece
has country: Greece
geoName: Athens
latitude: 37.983972
longitude: 23.727806

Bagalkote
type: NamedIndividual
type: City
type: Place
contained in: Bengaluru Urban
contained in: India
contained in: Karnataka
has state: Karnataka
geoName: Bagalkote
latitude: 16.1817
longitude: 75.6958

Bahrain
type: NamedIndividual
type: Country
type: Place
geoName: Bahrain

Bangalore
type: NamedIndividual
type: City
type: Place
contained in: Bangalore-Urban
contained in: Bengaluru Urban
contained in: India
contained in: Karnataka
has district: Bangalore-Urban
geoName: Bangalore
latitude: 12.983333
longitude: 77.583333

Bangalore-Urban
type: NamedIndividual
type: District
type: Place
contained in: Bengaluru Urban
contained in: India
contained in: Karnataka
contains: Bangalore
has state: Karnataka
geoName: Bangalore-Urban

Bangalore Rural
type: NamedIndividual
type: District
type: Place
contained in: Bengaluru Urban
contained in: India
contained in: Karnataka
contains: Nelamangala
has state: Karnataka
geoName: Bangalore Rural

Bangladesh
type: NamedIndividual
type: Country
type: Place
geoName: Bangladesh

Baroda
type: NamedIndividual
type: City
type: Place
contained in: Gujarat
contained in: India
has state: Gujarat
geoName: Baroda
latitude: 22.3
longitude: 73.2

Belagavi
type: NamedIndividual
type: City
type: Place
contained in: Bengaluru Urban
contained in: India
contained in: Karnataka
has state: Karnataka
geoName: Belagavi
latitude: 15.85
longitude: 74.5

Bellary
type: NamedIndividual
type: City
type: Place
contained in: Bellary District
contained in: Bengaluru Urban
contained in: India
contained in: Karnataka
has district: Bellary District
latitude: 15.1
longitude: 76.916667

Bellary District
type: NamedIndividual
type: District
type: Place
contained in: Bengaluru Urban
contained in: India
contained in: Karnataka
contains: Bellary
has state: Karnataka
geoName: Bellary District

BengUrbanDistStat000001
type: NamedIndividual
type: District wise statistics
type: Statistics
is covid-19 statistics of: Bengaluru Urban
cases: 59
metrics: 59

Bengaluru Urban
type: NamedIndividual
type: District
type: Place
contains: Bagalkote
contains: Bangalore
contains: Bangalore-Urban
contains: Bangalore Rural
contains: Belagavi
contains: Bellary
contains: Bellary District
contains: Bhatkal
contains: Bidar
contains: Carwar
contains: Chamarajanagar
contains: Channagiri
contains: Chikkaballapur
contains: Chitradurga
contains: Davangere
contains: Davangere District
contains: Dharwad
contains: Dharwad District
contains: Gadag
contains: Gadag-Betageri
contains: Gulbarga
contains: Hassan
contains: Haveri
contains: Hubballi
contains: Hubli
contains: Humnabad
contains: Kalaburagi
contains: Kalburgi
contains: Karnataka
contains: Karwara
contains: Coorg
contains: Koppal
contains: Koppala District
contains: Madikeri
contains: Mandya
contains: Mangalore
contains: Mangaluru
contains: Mysore
contains: Nanjangud
contains: Nelamangala
contains: Pharmaceutical Company In Nanjangud
contains: Raichore
contains: Ramanagara
contains: Ramanagara District
contains: Shahapur
contains: Shivamogga
contains: Tumkur
contains: Udupi
contains: Uttar Kannada
contains: North Canara
contains: Vijayapura
contains: Yadgir
district wise statistics: BengUrbanDistStat000001
district wise statistics: BengUrbanDistStat000002
has statistics: BengUrbanDistStat000001
has statistics: BengUrbanDistStat000002
is location for: COVID-19
geoName: Bengaluru Urban

Bhatkal
type: NamedIndividual
type: City
type: Place
contained in: Bengaluru Urban
contained in: India
contained in: Karnataka
has state: Karnataka
geoName: Bhatkal
latitude: 13.967
longitude: 74.567

Bidar
type: NamedIndividual
type: City
type: District
type: Place
contained in: Bengaluru Urban
contained in: India
contained in: Karnataka
contains: Humnabad
has state: Karnataka
geoName: Bidar
latitude: 17.9
longitude: 77.5

Bihar
type: NamedIndividual
type: Place
type: State
geoName: Bihar

Brazil
type: NamedIndividual
type: Country
type: Place
geoName: Brazil

Breathlessness
type: NamedIndividual
type: Symptom
type: Clinical finding (finding)

COVID-19
type: NamedIndividual
type: Coronavirus infection
type: Disease
type: Disease caused by Coronaviridae
type: Viral disease
type: Infectious disease
location: Bengaluru Urban
location: India
location: Karnataka
location: Uttar Pradesh
comment: A disease caused by severe acute respiratory syndrome coronavirus 2.
comment: Disease caused by 2019 novel coronavirus
comment: Disease caused by 2019-nCoV
comment: SCTID: 840539006

Cardiovascular Disease (CVD)
type: NamedIndividual
type: Comorbidity

Carwar
type: NamedIndividual
type: City
type: District
type: Place
contained in: Bengaluru Urban
contained in: India
contained in: Karnataka
has state: Karnataka
geoName: Carwar

Chamarajanagar
type: NamedIndividual
type: City
type: Place
contained in: Bengaluru Urban
contained in: India
contained in: Karnataka
has state: Karnataka
geoName: Chamarajanagar
latitude: 11.926
longitude: 76.9402

Channagiri
type: NamedIndividual
type: City
type: Place
contained in: Bengaluru Urban
contained in: Davangere District
contained in: India
contained in: Karnataka
has district: Davangere District
geoName: Channagiri
latitude: 14.03
longitude: 75.93

Chattisgadh
type: NamedIndividual
type: Place
type: State
contained in: India
has country: India
geoName: Chattisgadh

Chennai
type: NamedIndividual
type: City
type: Place
contained in: India
contained in: Tamil Nadu
has state: Tamil Nadu
geoName: Chennai
latitude: 13.0825
longitude: 80.275

Chikkaballapur
type: NamedIndividual
type: City
type: Place
contained in: Bengaluru Urban
contained in: India
contained in: Karnataka
has state: Karnataka
geoName: Chikkaballapur
latitude: 13.43
longitude: 77.72

Chikmagalur
type: NamedIndividual
type: City
type: Place
geoName: Chikmagalur
latitude: 13.313
longitude: 75.737

Chitradurga
type: NamedIndividual
type: City
type: Place
contained in: Bengaluru Urban
contained in: India
contained in: Karnataka
has state: Karnataka
geoName: Chitradurga
latitude: 14.23
longitude: 76.4

Chronic Kidney Disease (CKD)
type: NamedIndividual
type: Comorbidity

Chronic Kidney Insufficiency (CKI)
type: NamedIndividual
type: Comorbidity

Chronic Liver Disease (CLD)
type: NamedIndividual
type: Comorbidity

Chronic Obstructive Pulmonary Disease (COPD)
type: NamedIndividual
type: Comorbidity

Colombo
type: NamedIndividual
type: City
type: Place
contained in: Sri Lanka
contained in: Western Province
province: Western Province
geoName: Colombo
latitude: 6.934444
longitude: 79.842778

ContainmentZonesCluster
type: NamedIndividual
type: Cluster
type: ContactCluster
type: Group
type: Agent
comment: Containment Zones : The patients who were contacts of Conatinment Zones and their contacts. Some patients have the Ward represented in the Reason column.

Cough
type: NamedIndividual
type: Symptom
type: Clinical finding (finding)

Dadra And Nagar Haveli And Daman And Diu
type: NamedIndividual
type: UnionTerritory
type: Place
contained in: India
has country: India
geoName: Dadra And Nagar Haveli And Daman And Diu
comment: Dadra and Nagar Haveli and Daman and Diu (DNHDD) is a union territory in western India.

Dakshina Kannada District
type: NamedIndividual
type: District
type: Place
contained in: India
contains: Mangalore
contains: Mangaluru
has country: India
geoName: Dakshina Kannada District

Daman And Diu
type: NamedIndividual
type: UnionTerritory
type: Place
contained in: India
has country: India
geoName: Daman And Diu
comment: Until June 2019, Daman and Diu was an Union Territory of India. But since July 2019 it was merged to another Union Territory of India "Dadra and Nagar Haveli" and togtrehr formed a single union territory "Dadra and Nagar Haveli and Daman and Diu (DNHDD)."

Dammam
type: NamedIndividual
type: City
type: Place
contained in: Saudi Arabia
has country: Saudi Arabia
geoName: Dammam
latitude: 26.433333
longitude: 50.1

Davangere
type: NamedIndividual
type: City
type: Place
contained in: Bengaluru Urban
contained in: India
contained in: Karnataka
has state: Karnataka
geoName: Davangere
latitude: 14.4666
longitude: 75.9242

Davangere District
type: NamedIndividual
type: District
type: Place
contained in: Bengaluru Urban
contained in: India
contained in: Karnataka
contains: Channagiri
has state: Karnataka
geoName: Davangere District

Debaspete
type: NamedIndividual
type: City
type: Place
contained in: India
has country: India
geoName: Debaspete

Delhi
type: NamedIndividual
type: City
type: Place
contained in: India
has country: India
is location for: TJCongregation13thTo18thCluster
geoName: Delhi
latitude: 28.61
longitude: 77.23

Dharwad
type: NamedIndividual
type: City
type: Place
contained in: Bengaluru Urban
contained in: Dharwad District
contained in: India
contained in: Karnataka
has district: Dharwad District
geoName: Dharwad
latitude: 15.458333
longitude: 75.008333

Dharwad District
type: NamedIndividual
type: District
type: Place
contained in: Bengaluru Urban
contained in: India
contained in: Karnataka
contains: Dharwad
has state: Karnataka
geoName: Dharwad District

Diabetes Mellitus (DM)
type: NamedIndividual
type: Comorbidity

Diarrhea
type: NamedIndividual
type: Symptom
type: Clinical finding (finding)
comment: SCTID: 62315008

Diu
type: NamedIndividual
type: City
type: Place
contained in: India
has country: India
geoName: Diu
latitude: 20.71
longitude: 70.98

Doha
type: NamedIndividual
type: City
type: Place
contained in: Qatar
has country: Qatar
geoName: Doha
latitude: 25.286667
longitude: 51.533333

DomesticTravelHistoryAbsentCluster
type: NamedIndividual
type: Cluster
type: GeographicCluster
type: Group
type: Agent
location: India
comment: Domestic Travel History Absent : The patients for whom the information was given as "Travel History-Domestic"

Dry cough
type: NamedIndividual
type: Symptom
type: Clinical finding (finding)
comment: SCTID: 11833005

Dubai
type: NamedIndividual
type: City
type: Place
geoName: Dubai
latitude: 25.263056
longitude: 55.297222

Edinburgh
type: NamedIndividual
type: City
type: Place
contained in: Scotland
contained in: UK
has state: Scotland
geoName: Edinburgh
latitude: 55.953
longitude: -3.189

Fever
type: NamedIndividual
type: Symptom
type: Clinical finding (finding)
comment: SCTID: 386661006

France
type: NamedIndividual
type: Country
type: Place
contains: Paris
geoName: France

Gadag
type: NamedIndividual
type: City
type: Place
contained in: Bengaluru Urban
contained in: India
contained in: Karnataka
has country: India
has state: Karnataka
geoName: Gadag
latitude: 15.4167
longitude: 75.6167

Gadag-Betageri
type: NamedIndividual
type: City
type: Place
contained in: Bengaluru Urban
contained in: India
contained in: Karnataka
has country: India
has state: Karnataka
geoName: Gadag-Betageri
latitude: 15.4167
longitude: 75.6167

Germany
type: NamedIndividual
type: Country
type: Place
geoName: Germany

Goa
type: NamedIndividual
type: City
type: Place
geoName: Goa
latitude: 15.5
longitude: 73.83

Greece
type: NamedIndividual
type: Country
type: Place
contains: Athens
geoName: Greece

Gujarat
type: NamedIndividual
type: Place
type: State
contained in: India
contains: Ahmedabad
contains: Baroda
contains: Surat
has country: India
is location for: GujaratCluster
geoName: Gujarat

GujaratCluster
type: NamedIndividual
type: Cluster
type: GeographicCluster
type: Group
type: Agent
location: Gujarat
comment: From Gujarat : The patients with travel history to Gujarat and their contacts.

Gulbarga
type: NamedIndividual
type: City
type: District
type: Place
contained in: Bengaluru Urban
contained in: India
contained in: Karnataka
has state: Karnataka
geoName: Gulbarga
latitude: 17.329
longitude: 76.825

Guyana
type: NamedIndividual
type: Country
type: Place
geoName: Guyana
comment: officially the Co‑operative Republic of Guyana, is a country on the northern mainland of South America.

Hacking cough
type: NamedIndividual
type: Symptom
type: Clinical finding (finding)
comment: SCTTID: 59994004

Haryana
type: NamedIndividual
type: Place
type: State
contained in: India
has country: India
geoName: Haryana

Hassan
type: NamedIndividual
type: City
type: Place
contained in: Bengaluru Urban
contained in: India
contained in: Karnataka
has state: Karnataka
geoName: Hassan
latitude: 13.012
longitude: 76.068

Haveri
type: NamedIndividual
type: City
type: Place
contained in: Bengaluru Urban
contained in: India
contained in: Karnataka
has state: Karnataka
geoName: Haveri
latitude: 14.793889
longitude: 75.403889

Himachal Pradesh
type: NamedIndividual
type: Place
type: State
contained in: India
has country: India
geoName: Himachal Pradesh

Hindupur
type: NamedIndividual
type: City
type: Place
contained in: Anantapur
contained in: Andhra Pradesh
contained in: India
has district: Anantapur
geoName: Hindupur
latitude: 13.83
longitude: 77.49

Hubballi
type: NamedIndividual
type: City
type: Place
contained in: Bengaluru Urban
contained in: India
contained in: Karnataka
has state: Karnataka
geoName: Hubballi
latitude: 15.350217
longitude: 75.137625

Hubli
type: NamedIndividual
type: City
type: Place
contained in: Bengaluru Urban
contained in: India
contained in: Karnataka
has state: Karnataka
geoName: Hubli
latitude: 15.350217
longitude: 75.137625
comment: Hubli, officially known as Hubballi, is a city in the Indian state of Karnataka.

Humnabad
type: NamedIndividual
type: City
type: Place
contained in: Bengaluru Urban
contained in: Bidar
contained in: India
contained in: Karnataka
has district: Bidar
geoName: Humnabad
latitude: 17.77
longitude: 77.13
comment: a City and municipal council in the Bidar District of the Indian state of Karnataka and city is a headquarters of Humnabad taluk.

Hyderabad
type: NamedIndividual
type: City
type: Place
contained in: India
contained in: Telangana
has state: Telangana
geoName: Hyderabad
latitude: 17.37
longitude: 78.48

Hypertension (HTN)
type: NamedIndividual
type: Comorbidity

India
type: NamedIndividual
type: Country
type: Place
contains: Ahmedabad
contains: Ajmer
contains: Anantapur
contains: Andaman and Nicobar Islands
contains: Andhra Pradesh
contains: Assam
contains: Bagalkote
contains: Bangalore
contains: Bangalore-Urban
contains: Bangalore Rural
contains: Baroda
contains: Belagavi
contains: Bellary
contains: Bellary District
contains: Bhatkal
contains: Bidar
contains: Carwar
contains: Chamarajanagar
contains: Channagiri
contains: Chattisgadh
contains: Chennai
contains: Chikkaballapur
contains: Chitradurga
contains: Dadra And Nagar Haveli And Daman And Diu
contains: Dakshina Kannada District
contains: Daman And Diu
contains: Davangere
contains: Davangere District
contains: Debaspete
contains: Delhi
contains: Dharwad
contains: Dharwad District
contains: Diu
contains: Gadag
contains: Gadag-Betageri
contains: Gujarat
contains: Gulbarga
contains: Haryana
contains: Hassan
contains: Haveri
contains: Himachal Pradesh
contains: Hindupur
contains: Hubballi
contains: Hubli
contains: Humnabad
contains: Hyderabad
contains: Jalgaon
contains: Jalgaon District
contains: Jammu
contains: Jammu And Kashmir
contains: Jharkhand
contains: Kalaburagi
contains: Kalburgi
contains: Karnataka
contains: Karwara
contains: Kashmir
contains: Kerala
contains: Coorg
contains: Kolhapur
contains: Kolkata
contains: Koppal
contains: Koppala District
contains: Madhya Pradesh
contains: Madikeri
contains: Madurai
contains: Madurai District
contains: Maharashtra
contains: Mandya
contains: Mangalore
contains: Mangaluru
contains: Manipur
contains: Mumbai
contains: Mysore
contains: Nagaland
contains: Nandurbar
contains: Nandurbar District
contains: Nanjangud

IndiaStat000001
type: NamedIndividual
type: Country wise statistics
type: Statistics
is covid-19 statistics of: India
active: 14759
cases: 14759
cases: 18601
cases: 3252
cases: 590
deceased: 590
metrics: 14759
metrics: 18601
metrics: 3252
metrics: 590
recovered: 3252

Indonesia
type: NamedIndividual
type: Country
type: Place
geoName: Indonesia

InfluenzaLikeIllnessCluster
type: NamedIndividual
type: Cluster
type: DiseaseCluster
type: Group
type: Agent
comment: Influenza like illness : The patients showing influenza like symptoms and their contacts.

InternationalTravelHistoryAbsentCluster
type: NamedIndividual
type: Cluster
type: GeographicCluster
type: Group
type: Agent
location: The World
comment: International Travel History Absent : The patients for whom the information was given as "Travel History-International"

Iraq
type: NamedIndividual
type: Country
type: Place
geoName: Iraq
geoName: Republic of Iraq
comment: A country in Western Asia, bordered by Turkey to the north, Iran to the east, Kuwait to the southeast, Saudi Arabia to the south, Jordan to the southwest and Syria to the west.
label: Republic of Iraq

Ireland
type: NamedIndividual
type: Country
type: Place
geoName: Ireland

Ischemic Heart Disease (IHD)
type: NamedIndividual
type: Comorbidity

Italy
type: NamedIndividual
type: Country
type: Place
geoName: Italy

Jalgaon
type: NamedIndividual
type: City
type: Place
contained in: India
contained in: Jalgaon District
contained in: Maharashtra
has district: Jalgaon District
geoName: Jalgaon
latitude: 20.997984
longitude: 75.566711

Jalgaon District
type: NamedIndividual
type: District
type: Place
contained in: India
contained in: Maharashtra
contains: Jalgaon
has state: Maharashtra
geoName: Jalgaon District

Jammu
type: NamedIndividual
type: City
type: Place
contained in: India
contained in: Jammu And Kashmir
has state: Jammu And Kashmir
geoName: Jammu
latitude: 32.73
longitude: 74.87
comment: Jammu is the winter capital and the largest city in Jammu district of the Indian union territory of Jammu and Kashmir.

Jammu And Kashmir
type: NamedIndividual
type: UnionTerritory
type: Place
type: State
contained in: India
contains: Jammu
has country: India
geoName: Jammu And Kashmir

Jeddah
type: NamedIndividual
type: City
type: Place
contained in: Saudi Arabia
has country: Saudi Arabia
geoName: Jeddah
latitude: 21.543333
longitude: 39.172778

Jharkhand
type: NamedIndividual
type: Place
type: State
contained in: India
contains: Shikharaji
has country: India
geoName: Jharkhand

June-27TraceHistoryAbsentCluster
type: NamedIndividual
type: Cluster
type: Group
type: TimeCluster
type: Agent
date: 2020-06-27T00:00:00
event date: 2020-06-27T00:00:00
comment: 27-June Trace History Absent : On this day, no trace history information was given for the patients. Patients who were contacts of these individuals are also in this cluster.

June-28TraceHistoryAbsentCluster
type: NamedIndividual
type: Cluster
type: Group
type: TimeCluster
type: Agent
date: 2020-06-28T00:00:00
event date: 2020-06-28T00:00:00
comment: 28-June Trace History Absent : On this day, no trace history information was given for the patients. Patients who were contacts of these individuals are also in this cluster.

June-29TraceHistoryAbsentCluster
type: NamedIndividual
type: Cluster
type: Group
type: TimeCluster
type: Agent
date: 2020-06-29T00:00:00
event date: 2020-06-29T00:00:00
comment: 29-June Trace History Absent : On this day, no trace history information was given for the patients. Patients who were contacts of these individuals are also in this cluster.

Kalaburagi
type: NamedIndividual
type: City
type: District
type: Place
contained in: Bengaluru Urban
contained in: India
contained in: Karnataka
has state: Karnataka
geoName: Kalaburagi
latitude: 17.329
longitude: 76.825

Kalburgi
type: NamedIndividual
type: City
type: District
type: Place
contained in: Bengaluru Urban
contained in: India
contained in: Karnataka
has state: Karnataka
geoName: Kalburgi
latitude: 17.329
longitude: 76.825

Karnataka
type: NamedIndividual
type: Place
type: State
contained in: Bengaluru Urban
contained in: India
contains: Bagalkote
contains: Bangalore
contains: Bangalore-Urban
contains: Bangalore Rural
contains: Belagavi
contains: Bellary
contains: Bellary District
contains: Bhatkal
contains: Bidar
contains: Carwar
contains: Chamarajanagar
contains: Channagiri
contains: Chikkaballapur
contains: Chitradurga
contains: Davangere
contains: Davangere District
contains: Dharwad
contains: Dharwad District
contains: Gadag
contains: Gadag-Betageri
contains: Gulbarga
contains: Hassan
contains: Haveri
contains: Hubballi
contains: Hubli
contains: Humnabad
contains: Kalaburagi
contains: Kalburgi
contains: Karwara
contains: Coorg
contains: Koppal
contains: Koppala District
contains: Madikeri
contains: Mandya
contains: Mangalore
contains: Mangaluru
contains: Mysore
contains: Nanjangud
contains: Nelamangala
contains: Pharmaceutical Company In Nanjangud
contains: Raichore
contains: Ramanagara
contains: Ramanagara District
contains: Shahapur
contains: Shivamogga
contains: Tumkur
contains: Udupi
contains: Uttar Kannada
contains: North Canara
contains: Vijayapura
contains: Yadgir
has country: India
has statistics: karntStateStat000001
has statistics: karntStateStat000002
is location for: COVID-19
state wise statistics: karntStateStat000001
state wise statistics: karntStateStat000002
geoName: Karnataka

Karwara
type: NamedIndividual
type: City
type: District
type: Place
contained in: Bengaluru Urban
contained in: India
contained in: Karnataka
has state: Karnataka
geoName: Karwara

Kashmir
type: NamedIndividual
type: GeographicRegion
type: Place
contained in: India
has country: India
geoName: Kashmir

Kerala
type: NamedIndividual
type: Place
type: State
contained in: India
contains: Trivandrum
has country: India
geoName: Kerala

Coorg
type: NamedIndividual
type: District
type: Place
contained in: Bengaluru Urban
contained in: India
contained in: Karnataka
contains: Madikeri
has state: Karnataka
geoName: Coorg
geoName: Kodagu
comment: Kodagu, also called Coorg, is a district in Karnataka State.
label: Kodagu

Kodagu District
type: NamedIndividual
type: District
type: Place
geoName: Kodagu District

Kolhapur
type: NamedIndividual
type: City
type: Place
contained in: India
contained in: Maharashtra
has state: Maharashtra
geoName: Kolhapur
latitude: 16.691667
longitude: 74.233333

Kolkata
type: NamedIndividual
type: City
type: Place
contained in: India
contained in: West Bengal
has state: West Bengal
geoName: Kolkata
latitude: 22.5726
longitude: 88.3639

Koppal
type: NamedIndividual
type: City
type: Place
contained in: Bengaluru Urban
contained in: India
contained in: Karnataka
contained in: Koppala District
has district: Koppala District
geoName: Koppal
geoName: Koppala
latitude: 15.35
longitude: 76.15
comment: a city in Koppala district in the Indian state of Karnataka.
label: Koppala

Koppala District
type: NamedIndividual
type: District
type: Place
contained in: Bengaluru Urban
contained in: India
contained in: Karnataka
contains: Koppal
has state: Karnataka
geoName: Koppala District

Kuwait
type: NamedIndividual
type: Country
type: Place
geoName: Kuwait

London
type: NamedIndividual
type: City
type: Place
contained in: UK
has country: UK
geoName: London
latitude: 51.507222
longitude: -0.1275

Madhya Pradesh
type: NamedIndividual
type: Place
type: State
contained in: India
has country: India
geoName: Madhya Pradesh

Madikeri
type: NamedIndividual
type: City
type: Place
contained in: Bengaluru Urban
contained in: India
contained in: Karnataka
contained in: Coorg
has district: Coorg
geoName: Madikeri
latitude: 12.4209
longitude: 75.7397

Madrid
type: NamedIndividual
type: City
type: Place
contained in: Spain
has country: Spain
geoName: Madrid
latitude: 40.416667
longitude: -3.716667

Madurai
type: NamedIndividual
type: City
type: Place
contained in: India
contained in: Madurai District
contained in: Tamil Nadu
has district: Madurai District
geoName: Madurai
latitude: 9.9
longitude: 78.1

Madurai District
type: NamedIndividual
type: District
type: Place
contained in: India
contained in: Tamil Nadu
contains: Madurai
has state: Tamil Nadu
geoName: Madurai District

Maharashtra
type: NamedIndividual
type: Place
type: State
contained in: India
contains: Jalgaon
contains: Jalgaon District
contains: Kolhapur
contains: Mumbai
contains: Nandurbar
contains: Nandurbar District
contains: Palghar
contains: Panvel
contains: Pune
contains: Raigad
contains: Ratnagiri
contains: Ratnagiri District
contains: Solapur
contains: Thane
contains: Thane District
has country: India
is location for: MaharashtraCluster
geoName: Maharashtra

MaharashtraCluster
type: NamedIndividual
type: Cluster
type: GeographicCluster
type: Group
type: Agent
location: Maharashtra
comment: From Maharashtra : The patients with travel history to Maharashtra and their contacts.

Malaysia
type: NamedIndividual
type: Country
type: Place
geoName: Malaysia

Mandya
type: NamedIndividual
type: City
type: Place
contained in: Bengaluru Urban
contained in: India
contained in: Karnataka
has state: Karnataka
geoName: Mandya
latitude: 12.52
longitude: 76.9

Mangalore
type: NamedIndividual
type: City
type: Place
contained in: Bengaluru Urban
contained in: Dakshina Kannada District
contained in: India
contained in: Karnataka
has district: Dakshina Kannada District
has state: Karnataka
geoName: Mangalore
latitude: 12.78563
longitude: 74.84108

Mangaluru
type: NamedIndividual
type: City
type: Place
contained in: Bengaluru Urban
contained in: Dakshina Kannada District
contained in: India
contained in: Karnataka
has district: Dakshina Kannada District
has state: Karnataka
geoName: Mangaluru
latitude: 12.78563
longitude: 74.84108

Manipur
type: NamedIndividual
type: Place
type: State
contained in: India
has country: India
geoName: Manipur

Mecca
type: NamedIndividual
type: City
type: Place
contained in: Saudi Arabia
has country: Saudi Arabia
geoName: Mecca
latitude: 21.4225
longitude: 39.823333

Middle East
type: NamedIndividual
type: GeographicRegion
type: Place
is location for: MiddleEastCluster
geoName: Middle East

MiddleEastCluster
type: NamedIndividual
type: Cluster
type: GeographicCluster
type: Group
type: Agent
location: Middle East
comment: From Middle East : The patients with travel to the Middle East and their contacts.

Mumbai
type: NamedIndividual
type: City
type: Place
contained in: India
contained in: Maharashtra
has state: Maharashtra
geoName: Mumbai
latitude: 18.975
longitude: 72.825833

Muscat
type: NamedIndividual
type: City
type: Place
contained in: Oman
has country: Oman
geoName: Muscat
latitude: 23.588889
longitude: 58.408333

Mysore
type: NamedIndividual
type: District
type: Place
contained in: Bengaluru Urban
contained in: India
contained in: Karnataka
contains: Nanjangud
contains: Pharmaceutical Company In Nanjangud
has state: Karnataka
geoName: Mysore

Nagaland
type: NamedIndividual
type: Place
type: State
contained in: India
has country: India
geoName: Nagaland

Nandurbar
type: NamedIndividual
type: City
type: Place
contained in: India
contained in: Maharashtra
contained in: Nandurbar District
has district: Nandurbar District
geoName: Nandurbar
latitude: 21.37
longitude: 74.25

Nandurbar District
type: NamedIndividual
type: District
type: Place
contained in: India
contained in: Maharashtra
contains: Nandurbar
has state: Maharashtra
geoName: Nandurbar District

Nanjangud
type: NamedIndividual
type: City
type: Place
contained in: Bengaluru Urban
contained in: India
contained in: Karnataka
contained in: Mysore
contains: Pharmaceutical Company In Nanjangud
has district: Mysore
geoName: Nanjangud
latitude: 12.12
longitude: 76.68

Nasal congestion
type: NamedIndividual
type: Symptom
type: Clinical finding (finding)
comment: SCTID: 68235000

Nelamangala
type: NamedIndividual
type: City
type: Place
contained in: Bangalore Rural
contained in: Bengaluru Urban
contained in: India
contained in: Karnataka
has district: Bangalore Rural
geoName: Nelamangala
latitude: 13.102
longitude: 77.374

Nepal
type: NamedIndividual
type: Country
type: Place
geoName: Nepal

Netherlands
type: NamedIndividual
type: Country
type: Place
contains: Amsterdam
geoName: Netherlands

New York City
type: NamedIndividual
type: City
type: Place
contained in: New York State
contained in: USA
has state: New York State
geoName: New York City
latitude: 40.71274
longitude: -74.005974

New York State
type: NamedIndividual
type: Place
type: State
contained in: USA
contains: New York City
has country: USA
geoName: New York State

Not reported
type: NamedIndividual
type: Comorbidity

Oman
type: NamedIndividual
type: Country
type: Place
contains: Muscat
geoName: Oman

OthersCluster
type: NamedIndividual
type: Cluster
type: Group
type: Agent
comment: Others : The patients who had interdistrict travel in Karnataka, travel to countries / states, healthcare workers and policemen on COVID-19 duty and their contacts. The numbers for these reasons were too few to form separate clusters.

P000001-Vitals1
type: NamedIndividual
type: TestData
type: Test result
type: Vital signs
is test result for: p000001
Heart rate: 120
respiratory rate: 10

P000002-Vitals1
type: NamedIndividual
type: TestData
type: Test result
type: Vital signs
is test result for: p000002
date: 2020-04-26T09:00:00
respiratory rate: 15
test result on: 2020-04-26T09:00:00

P000002Diagnosis
type: NamedIndividual
type: COVID-19 Diagnosis
type: Diagnosis
type: Moderate COVID-19
type: TestData
type: Untested for COVID-19
type: Agent
type: Person
is diagnosis of: p000002
had covid test: false

P000003-Vitals1
type: NamedIndividual
type: TestData
type: Test result
type: Vital signs
is test result for: p000003
next test result: P000003-Vitals2
peripheral capillary oxygen saturation(SpO2): 90
date: 2020-04-21T10:00:00
respiratory rate: 35
test result on: 2020-04-21T10:00:00

P000003-Vitals2
type: NamedIndividual
type: TestData
type: Test result
type: Vital signs
is test result for: p000003
next test result: P000003-Vitals3
previous test result: P000003-Vitals1
date: 2020-04-22T10:00:00
test result on: 2020-04-22T10:00:00

P000003-Vitals3
type: NamedIndividual
type: TestData
type: Test result
type: Vital signs
is test result for: p000003
next test result: P000003-Vitals4
previous test result: P000003-Vitals2
date: 2020-04-23T11:00:00
test result on: 2020-04-23T11:00:00

P000003-Vitals4
type: NamedIndividual
type: TestData
type: Test result
type: Vital signs
is test result for: p000003
previous test result: P000003-Vitals3
peripheral capillary oxygen saturation(SpO2): 90
date: 2020-04-26T08:00:00
respiratory rate: 35
test result on: 2020-04-26T08:00:00

Pain
type: NamedIndividual
type: Symptom
type: Clinical finding (finding)
comment: SCTID: 22253000

Pain in throat
type: NamedIndividual
type: Symptom
type: Clinical finding (finding)
comment: SCTID: 162397003
label: Sore throat

Palghar
type: NamedIndividual
type: Town
type: Place
contained in: India
contained in: Maharashtra
has state: Maharashtra
geoName: Palghar

Panvel
type: NamedIndividual
type: City
type: Place
contained in: India
contained in: Maharashtra
contained in: Raigad
has district: Raigad
geoName: Panvel
latitude: 18.994444
longitude: 73.113889
comment: a locality in Raigad district of Maharashtra in India.

Paris
type: NamedIndividual
type: City
type: Place
contained in: France
has country: France
geoName: Paris
latitude: 48.856613
longitude: 2.352222

Pharmaceutical Company In Nanjangud
type: NamedIndividual
type: Business
type: Group
type: Agent
type: Organization
type: Place
contained in: Bengaluru Urban
contained in: India
contained in: Karnataka
contained in: Mysore
contained in: Nanjangud
has city: Nanjangud
is location for: PharmaceuticalCompanyInNanjangudCluster

PharmaceuticalCompanyInNanjangudCluster
type: NamedIndividual
type: Cluster
type: ContactCluster
type: Group
type: Agent
location: Pharmaceutical Company In Nanjangud
comment: Pharmaceutical Company in Nanjangud : This patients who were workers of a Pharmaceutical Company in Nanjangud, Mysore along with their contacts.

Philippines
type: NamedIndividual
type: Country
type: Place
geoName: Philippines

Pune
type: NamedIndividual
type: City
type: Place
contained in: India
contained in: Maharashtra
has state: Maharashtra
geoName: Pune
latitude: 18.520278
longitude: 73.856667

Punjab
type: NamedIndividual
type: GeographicRegion
type: Place
geoName: Punjab

Qatar
type: NamedIndividual
type: Country
type: Place
contains: Doha
geoName: Qatar

Raichore
type: NamedIndividual
type: City
type: District
type: Place
contained in: Bengaluru Urban
contained in: India
contained in: Karnataka
has state: Karnataka
geoName: Raichore
geoName: Raichur
latitude: 16.2
longitude: 77.37
comment: a city municipality in the district of Raichur in the Indian state of Karnataka.
label: Raichur
alternative label: Rayachuru

Raigad
type: NamedIndividual
type: District
type: Place
contained in: India
contained in: Maharashtra
contains: Panvel
has state: Maharashtra
geoName: Raigad
geoName: Raigadh
comment: Raigad District (formerly Kolába district), is a district in the Konkan division of Maharashtra, India.
label: Raigadh

Rajasthan
type: NamedIndividual
type: Place
type: State
contained in: India
contains: Ajmer
has country: India
is location for: RajasthanCluster
geoName: Rajasthan

RajasthanCluster
type: NamedIndividual
type: Cluster
type: GeographicCluster
type: Group
type: Agent
location: Rajasthan
comment: From Rajasthan : The patients with travel history to Rajasthan and their contacts.

Ramanagara
type: NamedIndividual
type: City
type: Place
contained in: Bengaluru Urban
contained in: India
contained in: Karnataka
contained in: Ramanagara District
has district: Ramanagara District
geoName: Ramanagara
latitude: 12.723
longitude: 77.286
comment: a city and a city municipal council in the Indian state of Karnataka.

Ramanagara District
type: NamedIndividual
type: District
type: Place
contained in: Bengaluru Urban
contained in: India
contained in: Karnataka
contains: Ramanagara
has state: Karnataka
geoName: Ramanagara District

Ratnagiri
type: NamedIndividual
type: City
type: Place
contained in: India
contained in: Maharashtra
contained in: Ratnagiri District
has district: Ratnagiri District
geoName: Ratnagiri
latitude: 16.994444
longitude: 73.3

Ratnagiri District
type: NamedIndividual
type: District
type: Place
contained in: India
contained in: Maharashtra
contains: Ratnagiri
has state: Maharashtra
geoName: Ratnagiri District

Rest Of Europe
type: NamedIndividual
type: GeographicRegion
type: Place
is location for: RestOfEuropeCluster
geoName: Rest Of Europe

RestOfEuropeCluster
type: NamedIndividual
type: Cluster
type: GeographicCluster
type: Group
type: Agent
location: Rest Of Europe
comment: From the rest of Europe : The patients with travel history to Europe but not to UK and their contacts.

Riyadh
type: NamedIndividual
type: City
type: Place
contained in: Saudi Arabia
has country: Saudi Arabia
geoName: Riyadh
latitude: 24.633333
longitude: 46.716667

Nasal discharge presen
type: NamedIndividual
type: Symptom
type: Clinical finding (finding)
comment: SCTID: 267101005
label: Nose dripping
label: Nose running

Saudi Arabia
type: NamedIndividual
type: Country
type: Place
contains: Dammam
contains: Jeddah
contains: Mecca
contains: Riyadh
geoName: Saudi Arabia

Scotland
type: NamedIndividual
type: Place
type: State
contained in: UK
contains: Edinburgh
has country: UK
geoName: Scotland

SecondGenerationContactAbsentCluster
type: NamedIndividual
type: Cluster
type: ContactCluster
type: Group
type: Agent
comment: Second Generation Contact Absent : The patients whose information was given as "Contact" without giving the patient ID of the individual they were a contact of.

SecondGenerationContactCluster
type: NamedIndividual
type: Cluster
type: ContactCluster
type: Group
type: Agent

SevereAcuteRespiratoryInfectionCluster
type: NamedIndividual
type: Cluster
type: DiseaseCluster
type: Group
type: Agent
comment: Severe Acute Respiratory Infection: This includes patients with a history of Severe Acute Respiratory Infection whose symptoms have resurfaced and their contacts.

Shahapur
type: NamedIndividual
type: City
type: Place
contained in: Bengaluru Urban
contained in: India
contained in: Karnataka
contained in: Yadgir
has district: Yadgir
geoName: Shahapur
latitude: 16.7
longitude: 76.83
comment: a city and taluka headquarter located in the Yadgir district of Indian state of Karnataka.

Sharjah
type: NamedIndividual
type: City
type: Place
contained in: United Arab Emirates
has country: United Arab Emirates
geoName: Sharjah
latitude: 25.3575
longitude: 55.390833

Shikharaji
type: NamedIndividual
type: City
type: Place
contained in: India
contained in: Jharkhand
has state: Jharkhand
geoName: Shikharaji
latitude: 23.9611
longitude: 86.1371

Shivamogga
type: NamedIndividual
type: City
type: Place
contained in: Bengaluru Urban
contained in: India
contained in: Karnataka
has state: Karnataka
geoName: Shivamogga
latitude: 13.933333
longitude: 75.566667

Singapore
type: NamedIndividual
type: City
type: Place
geoName: Singapore
latitude: 1.283333
longitude: 103.833333

Sneezing
type: NamedIndividual
type: Symptom
type: Clinical finding (finding)
comment: SCTID: 76067001

Solapur
type: NamedIndividual
type: City
type: Place
contained in: India
contained in: Maharashtra
has state: Maharashtra
geoName: Solapur
latitude: 17.68
longitude: 75.92

Republic of South Africa
type: NamedIndividual
type: Country
type: Place
geoName: Republic of South Africa

South America
type: NamedIndividual
type: GeographicRegion
type: Place
is location for: SouthAmericaCluster
geoName: South America

SouthAmericaCluster
type: NamedIndividual
type: Cluster
type: GeographicCluster
type: Group
type: Agent
location: South America
comment: From South America : The patients with travel history to South America and their contacts.

SouthernStatesCluster
type: NamedIndividual
type: Cluster
type: GeographicCluster
type: Group
type: Agent
location: Southern States Of India
comment: From the Southern States : The patients with travel to Kerala, Tamil Nadu, Andhra Pradesh or Telengana and their contacts. This doesn't contain patients with interdistrict travel in Karnataka

Southern States Of India
type: NamedIndividual
type: GeographicRegion
type: Place
is location for: SouthernStatesCluster
geoName: Southern States Of India
comment: Kerala, Tamil Nadu, Andhra Pradesh or Telengana. This doesn't contain Karnataka

Spain
type: NamedIndividual
type: Country
type: Place
contains: Madrid
geoName: Spain

Sri Lanka
type: NamedIndividual
type: Country
type: Place
contains: Colombo
contains: Western Province
geoName: Sri Lanka

Surat
type: NamedIndividual
type: City
type: Place
contained in: Gujarat
contained in: India
has state: Gujarat
geoName: Surat
latitude: 21.17024
longitude: 72.831061

Switzerland
type: NamedIndividual
type: Country
type: Place
geoName: Switzerland

TJCongregation13thTo18thCluster
type: NamedIndividual
type: Cluster
type: GeographicCluster
type: Group
type: TimeCluster
type: Agent
location: Delhi
date: 2020-03-13T00:00:00
date: 2020-03-18T00:00:00
end date: 2020-03-18T00:00:00
start date: 2020-03-13T00:00:00
comment: TJ Congregation from 13th to 18th March in Delhi : The patients with travel history to the TJ Congregation in Delhi and their contacts.

Tamil Nadu
type: NamedIndividual
type: Place
type: State
contained in: India
contains: Chennai
contains: Madurai
contains: Madurai District
contains: Vellore
contains: Vellore District
has country: India
geoName: Tamil Nadu

Telangana
type: NamedIndividual
type: Place
type: State
contained in: India
contains: Hyderabad
has country: India
geoName: Telangana

Texas
type: NamedIndividual
type: Place
type: State
contained in: USA
has country: USA
geoName: Texas

Thane
type: NamedIndividual
type: City
type: Place
contained in: India
contained in: Maharashtra
contained in: Thane District
has district: Thane District
geoName: Thane
latitude: 19.172431
longitude: 72.957019

Thane District
type: NamedIndividual
type: District
type: Place
contained in: India
contained in: Maharashtra
contains: Thane
has state: Maharashtra
geoName: Thane District

The World
type: NamedIndividual
type: GeographicRegion
type: Place
is location for: InternationalTravelHistoryAbsentCluster
geoName: The World
comment: Represents the geographic region of the entire world.

Feeling tired
type: NamedIndividual
type: Symptom
type: Clinical finding (finding)
comment: SCTID: 224960004

Trivandrum
type: NamedIndividual
type: City
type: Place
contained in: India
contained in: Kerala
has state: Kerala
geoName: Trivandrum
latitude: 8.4875
longitude: 76.9525

Tumkur
type: NamedIndividual
type: City
type: Place
contained in: Bengaluru Urban
contained in: India
contained in: Karnataka
has state: Karnataka
geoName: Tumkur
latitude: 13.34
longitude: 77.1

Turkey
type: NamedIndividual
type: Country
type: Place
geoName: Turkey

UK
type: NamedIndividual
type: Country
type: Place
contains: Edinburgh
contains: London
contains: Scotland
is location for: UnitedKingdomCluster
geoName: UK

Uttar Pradesh
type: NamedIndividual
type: Place
type: State
contained in: India
has country: India
has statistics: Bengalure Urban
has statistics: upStatState000002
is location for: COVID-19
state wise statistics: Bengalure Urban
state wise statistics: upStatState000002
geoName: UP
label: UP

URTI
type: NamedIndividual
type: Symptom
type: Clinical finding (finding)
comment: SCTID: 54150009
label: Upper Respiratory Tract Infection

USA
type: NamedIndividual
type: Country
type: Place
contains: New York City
contains: New York State
contains: Texas
is location for: USACluster
geoName: USA

USACluster
type: NamedIndividual
type: Cluster
type: GeographicCluster
type: Group
type: Agent
location: USA
comment: From USA : The patients who had travel history to USA and their contacts.

Udupi
type: NamedIndividual
type: City
type: Place
contained in: Bengaluru Urban
contained in: India
contained in: Karnataka
has state: Karnataka
geoName: Udupi
latitude: 13.3389
longitude: 74.7451

United Arab Emirates
type: NamedIndividual
type: Country
type: Place
contains: Sharjah
geoName: United Arab Emirates

UnitedKingdomCluster
type: NamedIndividual
type: Cluster
type: GeographicCluster
type: Group
type: Agent
location: UK
comment: From United Kingdom : The patients with travel history to UK and their contacts.

UnknownCluster
type: NamedIndividual
type: Cluster
type: Group
type: Agent
comment: Unknown : The patients who have been listed in the Media Bulletins as "Contact Under Tracing"and their contacts.

Uttar Kannada
type: NamedIndividual
type: District
type: Place
contained in: Bengaluru Urban
contained in: India
contained in: Karnataka
has state: Karnataka
geoName: Uttar Kannada

Uttar Pradesh
type: NamedIndividual
type: Place
type: State
geoName: Uttar Pradesh

North Canara
type: NamedIndividual
type: District
type: Place
contained in: Bengaluru Urban
contained in: India
contained in: Karnataka
has state: Karnataka
geoName: North Canara
geoName: Uttara Kannada
comment: Uttara Kannada, formerly known as North Canara, is a district in the Indian state of Karnataka.
label: Uttara Kannada

Vadodara District
type: NamedIndividual
type: District
type: Place
geoName: Vadodara District

Vellore
type: NamedIndividual
type: City
type: Place
contained in: India
contained in: Tamil Nadu
contained in: Vellore District
has district: Vellore District
geoName: Vellore
latitude: 12.920219
longitude: 79.133306

Vellore District
type: NamedIndividual
type: District
type: Place
contained in: India
contained in: Tamil Nadu
contains: Vellore
has state: Tamil Nadu
geoName: Vellore District

Vijayapura
type: NamedIndividual
type: City
type: Place
contained in: Bengaluru Urban
contained in: India
contained in: Karnataka
has state: Karnataka
geoName: Vijayapura
latitude: 13.29
longitude: 77.8

Vishakapatnam
type: NamedIndividual
type: City
type: Place
contained in: Andhra Pradesh
contained in: India
has state: Andhra Pradesh
geoName: Vishakapatnam
latitude: 17.704167
longitude: 83.297778

Ward 135
type: NamedIndividual
type: CityWard
type: Place
geoName: Ward 135

West Bengal
type: NamedIndividual
type: Place
type: State
contained in: India
contains: Kolkata
has country: India
geoName: West Bengal

Western Province
type: NamedIndividual
type: Province
type: Place
contained in: Sri Lanka
contains: Colombo
has country: Sri Lanka
geoName: Western Province
comment: is one of the nine provinces of Sri Lanka, the first level administrative division of the country.

Yadgir
type: NamedIndividual
type: District
type: Place
contained in: Bengaluru Urban
contained in: India
contained in: Karnataka
contains: Shahapur
has state: Karnataka
geoName: Yadgir

karntStateStat000001
type: NamedIndividual
type: State wise statistics
type: Statistics
is covid-19 statistics of: Karnataka
cases: 10
metrics: 10

karntStateStat000002
type: NamedIndividual
type: State wise statistics
type: Statistics
is covid-19 statistics of: Karnataka
cases: 10
metrics: 10

p000001
type: NamedIndividual
type: Diagnosed With COVID-19
type: Man
type: TestData
type: Agent
type: Person
type: Patient
has diagnosis: P000001Diagnosis
has symptom: Fever
has symptom: URTI
has test result: P000001-Vitals1
most recent test result: P000001-Vitals1
has gender: Male
had covid test: true
case id: T1

p000002
type: NamedIndividual
type: Diagnosed With COVID-19
type: TestData
type: Agent
type: Person
type: Patient
has diagnosis: P000002Diagnosis
has symptom: Pneumonia
has test result: P000002-Vitals1
most recent test result: P000002-Vitals1
had covid test: true
case id: T2

p000003
type: NamedIndividual
type: Diagnosed With COVID-19
type: TestData
type: Agent
type: Person
type: Patient
has diagnosis: P000003Diagnosis
has symptom: SeverePneumonia
has test result: P000003-Vitals1
has test result: P000003-Vitals2
has test result: P000003-Vitals3
has test result: P000003-Vitals4
most recent test result: P000003-Vitals4
had covid test: true
case id: T3

p000004
type: NamedIndividual
type: TestData
type: Untested for COVID-19
type: Agent
type: Person
type: Patient
had covid test: false
case id: T4

p000005
type: NamedIndividual
type: TestData
type: Untested for COVID-19
type: Agent
type: Person
type: Patient
had covid test: false
case id: T5

p000006
type: NamedIndividual
type: TestData
type: Untested for COVID-19
type: Agent
type: Person
type: Patient
had covid test: false
case id: T6

p000007
type: NamedIndividual
type: TestData
type: Untested for COVID-19
type: Agent
type: Person
type: Patient
had covid test: false
case id: T7

p000008
type: NamedIndividual
type: TestData
type: Untested for COVID-19
type: Woman
type: Agent
type: Person
type: Patient
has gender: Female
had covid test: false
case id: T8

p000009
type: NamedIndividual
type: TestData
type: Agent
type: Person
type: Patient
had covid test: true
case id: T9

p000010
type: NamedIndividual
type: TestData
type: Untested for COVID-19
type: Agent
type: Person
had covid test: false
case id: T10

p000011
type: NamedIndividual
type: TestData
type: Agent
type: Person
type: Patient
had covid test: true
case id: T11

p000012
type: NamedIndividual
type: TestData
type: Untested for COVID-19
type: Agent
type: Person
had covid test: false
case id: T12

p000013
type: NamedIndividual
type: TestData
type: Agent
type: Person
type: Patient
case id: T13

p000014
type: NamedIndividual
type: TestData
type: Agent
type: Person
type: Patient
case id: T14

p000015
type: NamedIndividual
type: TestData
type: Agent
type: Person
type: Patient
case id: T15

p000016
type: NamedIndividual
type: TestData
type: Agent
type: Person
type: Patient
case id: T16

p000018
type: NamedIndividual
type: TestData
type: Agent
type: Person
type: Patient
case id: T18

p000019
type: NamedIndividual
type: TestData
type: Agent
type: Person
type: Patient
case id: T19

p000020
type: NamedIndividual
type: TestData
type: Agent
type: Person
type: Patient
case id: T20

p000017
type: NamedIndividual
type: TestData
type: Agent
type: Person
type: Patient
case id: T17
comment: Note: had to give this test data id that may conflict with real data in order to process reason strings that require numeric computations on the ID's. I.e., they have to be numeric strings that can be converted to integers not string starting with "T" So make sure to delete this and similar test data before loading actual data.

p99992
type: NamedIndividual
type: TestData
type: Agent
type: Person
type: Patient
case id: 99992
comment: Note: had to give this test data id that may conflict with real data in order to process reason strings that require numeric computations on the ID's. I.e., they have to be numeric strings that can be converted to integers not string starting with "T" So make sure to delete this and similar test data before loading actual data.

p99993
type: NamedIndividual
type: TestData
type: Agent
type: Person
type: Patient
case id: 99993
comment: Note: had to give this test data id that may conflict with real data in order to process reason strings that require numeric computations on the ID's. I.e., they have to be numeric strings that can be converted to integers not string starting with "T" So make sure to delete this and similar test data before loading actual data.

Bengalure Urban
type: NamedIndividual
type: State wise statistics
type: Statistics
is covid-19 statistics of: Uttar Pradesh
cases: 15
metrics: 15

Mild and Very Mild Covid19 Diagnostic Rule
is rule enabled: true
type: Imp
body: IndividualPropertyAtom
  property predicate: has symptom
  argument1: http://www.isibang.ac.in/ns/covid19#p
  argument2: URTI
body: IndividualPropertyAtom
  property predicate: has diagnosis
  argument1: http://www.isibang.ac.in/ns/covid19#p
  argument2: http://www.isibang.ac.in/ns/covid19#d
body: IndividualPropertyAtom
  property predicate: has symptom
  argument1: http://www.isibang.ac.in/ns/covid19#p
  argument2: Fever
head: ClassAtom
  class predicate: Mild and very mild COVID-19
  argument1: http://www.isibang.ac.in/ns/covid19#d

Uncle Rule
is rule enabled: true
type: Imp
body: IndividualPropertyAtom
  property predicate: hasChild
  argument1: http://www.isibang.ac.in/ns/codo#p
  argument2: http://www.isibang.ac.in/ns/codo#c
body: IndividualPropertyAtom
  property predicate: hasBrother
  argument1: http://www.isibang.ac.in/ns/codo#p
  argument2: http://www.isibang.ac.in/ns/codo#b
head: IndividualPropertyAtom
  property predicate: hasUncle
  argument1: http://www.isibang.ac.in/ns/codo#c
  argument2: http://www.isibang.ac.in/ns/codo#b

Aunt Rule
is rule enabled: true
type: Imp
body: IndividualPropertyAtom
  property predicate: hasChild
  argument1: http://www.isibang.ac.in/ns/codo#p
  argument2: http://www.isibang.ac.in/ns/codo#c
body: IndividualPropertyAtom
  property predicate: hasSister
  argument1: http://www.isibang.ac.in/ns/codo#p
  argument2: http://www.isibang.ac.in/ns/codo#s
head: IndividualPropertyAtom
  property predicate: hasAunt
  argument1: http://www.isibang.ac.in/ns/codo#c
  argument2: http://www.isibang.ac.in/ns/codo#s

Niece Rule
is rule enabled: true
type: Imp
body: IndividualPropertyAtom
  property predicate: hasDaughter
  argument1: http://www.isibang.ac.in/ns/codo#p
  argument2: http://www.isibang.ac.in/ns/codo#c
body: IndividualPropertyAtom
  property predicate: hasSibling
  argument1: http://www.isibang.ac.in/ns/codo#p
  argument2: http://www.isibang.ac.in/ns/codo#s
head: IndividualPropertyAtom
  property predicate: hasNiece
  argument1: http://www.isibang.ac.in/ns/codo#s
  argument2: http://www.isibang.ac.in/ns/codo#c

Nephew Rule
is rule enabled: true
type: Imp
body: IndividualPropertyAtom
  property predicate: hasSon
  argument1: http://www.isibang.ac.in/ns/codo#p
  argument2: http://www.isibang.ac.in/ns/codo#c
body: IndividualPropertyAtom
  property predicate: hasSibling
  argument1: http://www.isibang.ac.in/ns/codo#p
  argument2: http://www.isibang.ac.in/ns/codo#s
head: IndividualPropertyAtom
  property predicate: hasNephew
  argument1: http://www.isibang.ac.in/ns/codo#s
  argument2: http://www.isibang.ac.in/ns/codo#c

Moderate Covid19 Diagnostic Rule
is rule enabled: true
type: Imp
body: IndividualPropertyAtom
  property predicate: has diagnosis
  argument1: http://www.isibang.ac.in/ns/covid19#p
  argument2: http://www.isibang.ac.in/ns/covid19#d
body: IndividualPropertyAtom
  property predicate: most recent test result
  argument1: http://www.isibang.ac.in/ns/covid19#p
  argument2: tr
body: IndividualPropertyAtom
  property predicate: has symptom
  argument1: http://www.isibang.ac.in/ns/covid19#p
  argument2: Pneumonia
body: BuiltinAtom
  builtin: greaterThanOrEqual
  arguments: http://www.isibang.ac.in/ns/covid19#r
  arguments: 15
body: DatavaluedPropertyAtom
  property predicate: respiratory rate
  argument1: tr
  argument2: http://www.isibang.ac.in/ns/covid19#r
head: ClassAtom
  class predicate: Moderate COVID-19
  argument1: http://www.isibang.ac.in/ns/covid19#d

Severe Covid19 Diagnostic Rule
is rule enabled: true
type: Imp
body: IndividualPropertyAtom
  property predicate: has diagnosis
  argument1: http://www.isibang.ac.in/ns/covid19#p
  argument2: http://www.isibang.ac.in/ns/covid19#d
body: IndividualPropertyAtom
  property predicate: most recent test result
  argument1: http://www.isibang.ac.in/ns/covid19#p
  argument2: tr
body: IndividualPropertyAtom
  property predicate: has symptom
  argument1: http://www.isibang.ac.in/ns/covid19#p
  argument2: SeverePneumonia
body: DatavaluedPropertyAtom
  property predicate: peripheral capillary oxygen saturation(SpO2)
  argument1: tr
  argument2: sp
body: ClassAtom
  class predicate: Person
  argument1: http://www.isibang.ac.in/ns/covid19#p
body: BuiltinAtom
  builtin: greaterThanOrEqual
  arguments: http://www.isibang.ac.in/ns/covid19#r
  arguments: 30
body: DatavaluedPropertyAtom
  property predicate: respiratory rate
  argument1: tr
  argument2: http://www.isibang.ac.in/ns/covid19#r
body: BuiltinAtom
  builtin: greaterThanOrEqual
  arguments: sp
  arguments: 90
head: ClassAtom
  class predicate: Severe COVID-19
  argument1: http://www.isibang.ac.in/ns/covid19#d