Mild and Very Mild Covid19 Diagnostic Rule
type: Imp
is rule enabled: true
body: IndividualPropertyAtom
  argument1: http://www.isibang.ac.in/ns/covid19#p
  argument2: URTI
  property predicate: has symptom
body: IndividualPropertyAtom
  argument1: http://www.isibang.ac.in/ns/covid19#p
  argument2: http://www.isibang.ac.in/ns/covid19#d
  property predicate: has diagnosis
body: IndividualPropertyAtom
  argument1: http://www.isibang.ac.in/ns/covid19#p
  argument2: Fever
  property predicate: has symptom
head: ClassAtom
  argument1: http://www.isibang.ac.in/ns/covid19#d
  class predicate: Mild and very mild COVID-19

Uncle Rule
type: Imp
is rule enabled: true
body: IndividualPropertyAtom
  argument1: http://www.isibang.ac.in/ns/codo#p
  argument2: http://www.isibang.ac.in/ns/codo#c
  property predicate: hasChild
body: IndividualPropertyAtom
  argument1: http://www.isibang.ac.in/ns/codo#p
  argument2: http://www.isibang.ac.in/ns/codo#b
  property predicate: hasBrother
head: IndividualPropertyAtom
  argument1: http://www.isibang.ac.in/ns/codo#c
  argument2: http://www.isibang.ac.in/ns/codo#b
  property predicate: hasUncle

Aunt Rule
type: Imp
is rule enabled: true
body: IndividualPropertyAtom
  argument1: http://www.isibang.ac.in/ns/codo#p
  argument2: http://www.isibang.ac.in/ns/codo#c
  property predicate: hasChild
body: IndividualPropertyAtom
  argument1: http://www.isibang.ac.in/ns/codo#p
  argument2: http://www.isibang.ac.in/ns/codo#s
  property predicate: hasSister
head: IndividualPropertyAtom
  argument1: http://www.isibang.ac.in/ns/codo#c
  argument2: http://www.isibang.ac.in/ns/codo#s
  property predicate: hasAunt

Niece Rule
type: Imp
is rule enabled: true
body: IndividualPropertyAtom
  argument1: http://www.isibang.ac.in/ns/codo#p
  argument2: http://www.isibang.ac.in/ns/codo#c
  property predicate: hasDaughter
body: IndividualPropertyAtom
  argument1: http://www.isibang.ac.in/ns/codo#p
  argument2: http://www.isibang.ac.in/ns/codo#s
  property predicate: hasSibling
head: IndividualPropertyAtom
  argument1: http://www.isibang.ac.in/ns/codo#s
  argument2: http://www.isibang.ac.in/ns/codo#c
  property predicate: hasNiece

Nephew Rule
type: Imp
is rule enabled: true
body: IndividualPropertyAtom
  argument1: http://www.isibang.ac.in/ns/codo#p
  argument2: http://www.isibang.ac.in/ns/codo#c
  property predicate: hasSon
body: IndividualPropertyAtom
  argument1: http://www.isibang.ac.in/ns/codo#p
  argument2: http://www.isibang.ac.in/ns/codo#s
  property predicate: hasSibling
head: IndividualPropertyAtom
  argument1: http://www.isibang.ac.in/ns/codo#s
  argument2: http://www.isibang.ac.in/ns/codo#c
  property predicate: hasNephew

Moderate Covid19 Diagnostic Rule
type: Imp
is rule enabled: true
body: IndividualPropertyAtom
  argument1: http://www.isibang.ac.in/ns/covid19#p
  argument2: http://www.isibang.ac.in/ns/covid19#d
  property predicate: has diagnosis
body: IndividualPropertyAtom
  argument1: http://www.isibang.ac.in/ns/covid19#p
  argument2: tr
  property predicate: most recent test result
body: IndividualPropertyAtom
  argument1: http://www.isibang.ac.in/ns/covid19#p
  argument2: Pneumonia
  property predicate: has symptom
body: BuiltinAtom
  arguments: http://www.isibang.ac.in/ns/covid19#r
  arguments: 15
  builtin: greaterThanOrEqual
body: DatavaluedPropertyAtom
  argument1: tr
  argument2: http://www.isibang.ac.in/ns/covid19#r
  property predicate: respiratory rate
head: ClassAtom
  argument1: http://www.isibang.ac.in/ns/covid19#d
  class predicate: Moderate COVID-19

Severe Covid19 Diagnostic Rule
type: Imp
is rule enabled: true
body: IndividualPropertyAtom
  argument1: http://www.isibang.ac.in/ns/covid19#p
  argument2: http://www.isibang.ac.in/ns/covid19#d
  property predicate: has diagnosis
body: IndividualPropertyAtom
  argument1: http://www.isibang.ac.in/ns/covid19#p
  argument2: tr
  property predicate: most recent test result
body: IndividualPropertyAtom
  argument1: http://www.isibang.ac.in/ns/covid19#p
  argument2: SeverePneumonia
  property predicate: has symptom
body: DatavaluedPropertyAtom
  argument1: tr
  argument2: sp
  property predicate: peripheral capillary oxygen saturation(SpO2)
body: ClassAtom
  argument1: http://www.isibang.ac.in/ns/covid19#p
  class predicate: Person
body: BuiltinAtom
  arguments: http://www.isibang.ac.in/ns/covid19#r
  arguments: 30
  builtin: greaterThanOrEqual
body: DatavaluedPropertyAtom
  argument1: tr
  argument2: http://www.isibang.ac.in/ns/covid19#r
  property predicate: respiratory rate
body: BuiltinAtom
  arguments: sp
  arguments: 90
  builtin: greaterThanOrEqual
head: ClassAtom
  argument1: http://www.isibang.ac.in/ns/covid19#d
  class predicate: Severe COVID-19

Symptom
type: Class
comment: A symptom is a perceived change in function, sensation, loss, disturbance or appearance reported by a patient indicative of a disease.
comment: Source: https://www.mohfw.gov.in/pdf/FinalGuidanceonMangaementofCovidcasesversion2.pdf https://www.who.int/news-room/q-a-detail/q-a-coronaviruses
equivalent class: Clinical finding (finding)

CovidTestingFacility
type: Class
comment: A Medical clinic where testing for the COVID-19 Coronavirus disease is available.
comment: Covid testing facility
subclass of: Medical clinic

Medical clinic
type: Class
comment: A facility, often associated with a hospital or medical school, that is devoted to the specific diagnosis and/or healthcare.
subclass of: Organization

Clinical finding (finding)
type: Class

An Ontology for Representation and Publication of COVID-19 Cases and Patient Information
type: Ontology
designed for ontology task: This COVID-19 ontology is a data model for publishing COVID-19 data on the Web as a Graph. The primary focuses of the model are: (1) COVID-19 cases: the data for COVID-19 cases (e.g., active, recovered, deceased, migrated) ondaily basis across the geo-location (district, state and country), available resources and requirements; (2) COVID-19 patient data: nationality, symptom, suspected level of covid -19 cases, covid-19 treatment facility, covid-19 clinical facility, patient's travel history, inter-personal relationships between patients, suspected transmission reason, tracking of patient test results, etc.
created: 2020-04-27T10:00:00
creator: Biswanath Dutta (Indian Statistical Institute, India)
creator: Michael DeBellis (Semantic Web Consultant, USA)
license: https://creativecommons.org/licenses/by/4.0/
publisher: Indian Statistical Institute
browsing UI: http://www.isibang.ac.in/ns/codo
competency question: Some example competency questions: How many people recovered from COVId-19 in place p until date t? How many people died in country c? Give me the travel history of patient p? Give me the COVID-19 patients and their relationship, if any. Give me the COVID-19 patients who are in family relationships. Give me the primary reasons for the maximum number of COVID-19 patients. Give me the most prevalent symtopms of Severe COVID-19.
version IRI: http://w3id.org/codo/1.3

Abu Dhabi
type: NamedIndividual
type: City
type: Place
geoName: Abu Dhabi
latitude: 24.466667
longitude: 54.366667

Generalized aches and pains (finding)
type: NamedIndividual
type: Symptom
type: Clinical finding (finding)
comment: SCTID: 82991003

Acute Respiratory Distress Syndrome (ARDS)
type: NamedIndividual
type: Comorbidity

Ahmedabad
type: NamedIndividual
type: City
type: Place
contained in: Gujarat
contained in: India
geoName: Ahmedabad
has state: Gujarat
latitude: 23.03
longitude: 72.58

Ajmer
type: NamedIndividual
type: City
type: Place
contained in: India
contained in: Rajasthan
geoName: Ajmer
has state: Rajasthan
latitude: 26.4499
longitude: 74.6399

Amsterdam
type: NamedIndividual
type: City
type: Place
contained in: Netherlands
geoName: Amsterdam
has country: Netherlands
latitude: 52.366667
longitude: 4.9

Anantapur
type: NamedIndividual
type: District
type: Place
contained in: Andhra Pradesh
contained in: India
contains: Hindupur
geoName: Anantapur
has state: Andhra Pradesh

Andaman and Nicobar Islands
type: NamedIndividual
type: UnionTerritory
type: Place
contained in: India
geoName: Andaman and Nicobar Islands
has country: India
comment: A union territory of India comprising 572 islands of which 37 are inhabited, are a group of islands at the juncture of the Bay of Bengal and the Andaman Sea.

Andhra Pradesh
type: NamedIndividual
type: Place
type: State
contained in: India
contains: Anantapur
contains: Hindupur
contains: Vishakapatnam
geoName: Andhra Pradesh
has country: India

Anniversary
type: Class
subclass of: Gathering

Argentina
type: NamedIndividual
type: Country
type: Place
geoName: Argentina

Assam
type: NamedIndividual
type: Place
type: State
contained in: India
geoName: Assam
has country: India

Athens
type: NamedIndividual
type: City
type: Place
contained in: Greece
geoName: Athens
has country: Greece
latitude: 37.983972
longitude: 23.727806

Blood Pressure (Distolic)
type: DatatypeProperty
type: FunctionalProperty
domain: Vital signs
range: integer
sub property of: topDataProperty

Blood Pressure (Systolic)
type: DatatypeProperty
type: FunctionalProperty
domain: Vital signs
range: integer

Bagalkote
type: NamedIndividual
type: City
type: Place
contained in: Bengaluru Urban
contained in: India
contained in: Karnataka
geoName: Bagalkote
has state: Karnataka
latitude: 16.1817
longitude: 75.6958

Bahrain
type: NamedIndividual
type: Country
type: Place
geoName: Bahrain

Bangalore
type: NamedIndividual
type: City
type: Place
contained in: Bangalore-Urban
contained in: Bengaluru Urban
contained in: India
contained in: Karnataka
geoName: Bangalore
has district: Bangalore-Urban
latitude: 12.983333
longitude: 77.583333

Bangalore-Urban
type: NamedIndividual
type: District
type: Place
contained in: Bengaluru Urban
contained in: India
contained in: Karnataka
contains: Bangalore
geoName: Bangalore-Urban
has state: Karnataka

Bangalore Rural
type: NamedIndividual
type: District
type: Place
contained in: Bengaluru Urban
contained in: India
contained in: Karnataka
contains: Nelamangala
geoName: Bangalore Rural
has state: Karnataka

Bangladesh
type: NamedIndividual
type: Country
type: Place
geoName: Bangladesh

Baroda
type: NamedIndividual
type: City
type: Place
contained in: Gujarat
contained in: India
geoName: Baroda
has state: Gujarat
latitude: 22.3
longitude: 73.2

Belagavi
type: NamedIndividual
type: City
type: Place
contained in: Bengaluru Urban
contained in: India
contained in: Karnataka
geoName: Belagavi
has state: Karnataka
latitude: 15.85
longitude: 74.5

Bellary
type: NamedIndividual
type: City
type: Place
contained in: Bellary District
contained in: Bengaluru Urban
contained in: India
contained in: Karnataka
has district: Bellary District
latitude: 15.1
longitude: 76.916667

Bellary District
type: NamedIndividual
type: District
type: Place
contained in: Bengaluru Urban
contained in: India
contained in: Karnataka
contains: Bellary
geoName: Bellary District
has state: Karnataka

BengUrbanDistStat000001
type: NamedIndividual
type: District wise statistics
type: Statistics
cases: 59
is covid-19 statistics of: Bengaluru Urban
metrics: 59

Bengaluru Urban
type: NamedIndividual
type: District
type: Place
contains: Bagalkote
contains: Bangalore
contains: Bangalore-Urban
contains: Bangalore Rural
contains: Belagavi
contains: Bellary
contains: Bellary District
contains: Bhatkal
contains: Bidar
contains: Carwar
contains: Chamarajanagar
contains: Channagiri
contains: Chikkaballapur
contains: Chitradurga
contains: Davangere
contains: Davangere District
contains: Dharwad
contains: Dharwad District
contains: Gadag
contains: Gadag-Betageri
contains: Gulbarga
contains: Hassan
contains: Haveri
contains: Hubballi
contains: Hubli
contains: Humnabad
contains: Kalaburagi
contains: Kalburgi
contains: Karnataka
contains: Karwara
contains: Coorg
contains: Koppal
contains: Koppala District
contains: Madikeri
contains: Mandya
contains: Mangalore
contains: Mangaluru
contains: Mysore
contains: Nanjangud
contains: Nelamangala
contains: Pharmaceutical Company In Nanjangud
contains: Raichore
contains: Ramanagara
contains: Ramanagara District
contains: Shahapur
contains: Shivamogga
contains: Tumkur
contains: Udupi
contains: Uttar Kannada
contains: North Canara
contains: Vijayapura
contains: Yadgir
district wise statistics: BengUrbanDistStat000001
district wise statistics: BengUrbanDistStat000002
geoName: Bengaluru Urban
has statistics: BengUrbanDistStat000001
has statistics: BengUrbanDistStat000002
is location for: COVID-19

Bhatkal
type: NamedIndividual
type: City
type: Place
contained in: Bengaluru Urban
contained in: India
contained in: Karnataka
geoName: Bhatkal
has state: Karnataka
latitude: 13.967
longitude: 74.567

Bidar
type: NamedIndividual
type: City
type: District
type: Place
contained in: Bengaluru Urban
contained in: India
contained in: Karnataka
contains: Humnabad
geoName: Bidar
has state: Karnataka
latitude: 17.9
longitude: 77.5

Bihar
type: NamedIndividual
type: Place
type: State
geoName: Bihar

Brazil
type: NamedIndividual
type: Country
type: Place
geoName: Brazil

Breathlessness
type: NamedIndividual
type: Symptom
type: Clinical finding (finding)

Business
type: Class
subclass of: Organization

COVID-19
type: NamedIndividual
type: Coronavirus infection
type: Disease
type: Disease caused by Coronaviridae
type: Viral disease
type: Infectious disease
location: Bengaluru Urban
location: India
location: Karnataka
location: UP
comment: A disease caused by severe acute respiratory syndrome coronavirus 2.
comment: Disease caused by 2019 novel coronavirus
comment: Disease caused by 2019-nCoV
comment: SCTID: 840539006

COVID-19 dedicated facility
type: Class
comment: Any facility for providing care to COVID-19 patients.
comment: source: https://www.mohfw.gov.in/pdf/FinalGuidanceonMangaementofCovidcasesversion2.pdf
subclass of: Organization

COVID-19 Diagnosis
type: Class
comment: The diagnosis as COVID-19 patient. The diagnosied COVID-19 patients are categorised to three different categories/cases based on various clinical test and vital signs.
subclass of: Diagnosis

Cardiovascular Disease (CVD)
type: NamedIndividual
type: Comorbidity

Carwar
type: NamedIndividual
type: City
type: District
type: Place
contained in: Bengaluru Urban
contained in: India
contained in: Karnataka
geoName: Carwar
has state: Karnataka

Chamarajanagar
type: NamedIndividual
type: City
type: Place
contained in: Bengaluru Urban
contained in: India
contained in: Karnataka
geoName: Chamarajanagar
has state: Karnataka
latitude: 11.926
longitude: 76.9402

Channagiri
type: NamedIndividual
type: City
type: Place
contained in: Bengaluru Urban
contained in: Davangere District
contained in: India
contained in: Karnataka
geoName: Channagiri
has district: Davangere District
latitude: 14.03
longitude: 75.93

Chattisgadh
type: NamedIndividual
type: Place
type: State
contained in: India
geoName: Chattisgadh
has country: India

Chennai
type: NamedIndividual
type: City
type: Place
contained in: India
contained in: Tamil Nadu
geoName: Chennai
has state: Tamil Nadu
latitude: 13.0825
longitude: 80.275

Chikkaballapur
type: NamedIndividual
type: City
type: Place
contained in: Bengaluru Urban
contained in: India
contained in: Karnataka
geoName: Chikkaballapur
has state: Karnataka
latitude: 13.43
longitude: 77.72

Chikmagalur
type: NamedIndividual
type: City
type: Place
geoName: Chikmagalur
latitude: 13.313
longitude: 75.737

Chitradurga
type: NamedIndividual
type: City
type: Place
contained in: Bengaluru Urban
contained in: India
contained in: Karnataka
geoName: Chitradurga
has state: Karnataka
latitude: 14.23
longitude: 76.4

Chronic Kidney Disease (CKD)
type: NamedIndividual
type: Comorbidity

Chronic Kidney Insufficiency (CKI)
type: NamedIndividual
type: Comorbidity

Chronic Liver Disease (CLD)
type: NamedIndividual
type: Comorbidity

Chronic Obstructive Pulmonary Disease (COPD)
type: NamedIndividual
type: Comorbidity

City
type: Class
comment: A city.
comment: Towns with population of 1,00,000 and above are called cities.
subclass of: Place

CityWard
type: Class
comment: A ward is a containedIn a city. Calling it CityWard to avoid confusion with a hospital ward.
subclass of: Place

Close contact
type: Class
comment: Close contact, a suspected cause for catching COVID-19.
subclass of: Exposure to COVID-19

Cluster
type: Class
comment: A Cluster is a group of patients with the same disease who are grouped by one or more properties that are considered critical to an analysis of how the disease has spread.
subclass of: Group

Colombo
type: NamedIndividual
type: City
type: Place
contained in: Sri Lanka
contained in: Western Province
geoName: Colombo
province: Western Province
latitude: 6.934444
longitude: 79.842778

Comorbidity
type: Class
comment: indicate a medical condition existing simultaneously but independently with another condition in a patient (source: Wikipedia)

ContactCluster
type: Class
comment: A cluster defined by contact with certain individuals. Note that to some extent all clusters are contact clusters so this class is used only for those clusters that specifically mention contact with individuals (or lack of knowledge about such contact) rather than geographic, time, or disease data.
subclass of: Cluster

ContainmentZonesCluster
type: NamedIndividual
type: Cluster
type: ContactCluster
type: Group
type: Agent
comment: Containment Zones : The patients who were contacts of Conatinment Zones and their contacts. Some patients have the Ward represented in the Reason column.

Coronavirus infection
type: Class
comment: Coronaviruses are a large family of viruses which may cause illness in animals or humans. In humans, several coronaviruses are known to cause respiratory infections ranging from the common cold to more severe diseases such as Middle East Respiratory Syndrome (MERS) and Severe Acute Respiratory Syndrome (SARS). (source: https://www.who.int/news-room/q-a-detail/q-a-coronaviruses)
comment: SCTID: 186747009
subclass of: Disease caused by Coronaviridae

Cough
type: NamedIndividual
type: Symptom
type: Clinical finding (finding)

Country wise statistics
type: Class
subclass of: Statistics

Covid Care Centre (CCC)
type: Class
comment: Any facility, such as hotels/lodges/hostels/stadiums for providing care to COVID-19 patients are reffered as Covid Care Centre (CCC).
subclass of: COVID-19 dedicated facility

Dadra And Nagar Haveli And Daman And Diu
type: NamedIndividual
type: UnionTerritory
type: Place
contained in: India
geoName: Dadra And Nagar Haveli And Daman And Diu
has country: India
comment: Dadra and Nagar Haveli and Daman and Diu (DNHDD) is a union territory in western India.

Dakshina Kannada District
type: NamedIndividual
type: District
type: Place
contained in: India
contains: Mangalore
contains: Mangaluru
geoName: Dakshina Kannada District
has country: India

Daman And Diu
type: NamedIndividual
type: UnionTerritory
type: Place
contained in: India
geoName: Daman And Diu
has country: India
comment: Until June 2019, Daman and Diu was an Union Territory of India. But since July 2019 it was merged to another Union Territory of India "Dadra and Nagar Haveli" and togtrehr formed a single union territory "Dadra and Nagar Haveli and Daman and Diu (DNHDD)."

Dammam
type: NamedIndividual
type: City
type: Place
contained in: Saudi Arabia
geoName: Dammam
has country: Saudi Arabia
latitude: 26.433333
longitude: 50.1

Davangere
type: NamedIndividual
type: City
type: Place
contained in: Bengaluru Urban
contained in: India
contained in: Karnataka
geoName: Davangere
has state: Karnataka
latitude: 14.4666
longitude: 75.9242

Davangere District
type: NamedIndividual
type: District
type: Place
contained in: Bengaluru Urban
contained in: India
contained in: Karnataka
contains: Channagiri
geoName: Davangere District
has state: Karnataka

Debaspete
type: NamedIndividual
type: City
type: Place
contained in: India
geoName: Debaspete
has country: India

Dedicated Covid Health Centre (DCHC)
type: Class
comment: The Dedicated COVID Health Centre are hospitals that shall offer care for all cases that have been clinically assigned as moderate.
subclass of: COVID-19 dedicated facility

Dedicated Covid Hospital (DCH)
type: Class
comment: The Dedicated COVID Hospitals are hospitals that shall offer comprehensive care primarily for those who have been clinically assigned as severe.
subclass of: COVID-19 dedicated facility

Delhi
type: NamedIndividual
type: City
type: Place
contained in: India
geoName: Delhi
has country: India
is location for: TJCongregation13thTo18thCluster
latitude: 28.61
longitude: 77.23

Dharwad
type: NamedIndividual
type: City
type: Place
contained in: Bengaluru Urban
contained in: Dharwad District
contained in: India
contained in: Karnataka
geoName: Dharwad
has district: Dharwad District
latitude: 15.458333
longitude: 75.008333

Dharwad District
type: NamedIndividual
type: District
type: Place
contained in: Bengaluru Urban
contained in: India
contained in: Karnataka
contains: Dharwad
geoName: Dharwad District
has state: Karnataka

Diabetes Mellitus (DM)
type: NamedIndividual
type: Comorbidity

Diagnosed With COVID-19
type: Class
comment: A person diagnosed With COVID-19.
subclass of: Patient
equivalent class: Class
  intersection of: Patient
  intersection of: Restriction
    on property: has diagnosis
    some values from: COVID-19 Diagnosis

Diagnosis
type: Class
comment: SCTID: 439401001
comment: identifying the nature or cause of some phenomenon.

DiagnosisType
type: Class
comment: This models the manner in which a diagnosis was discovered. E.g., via a pregnancy test, screening for a suspected disease, tests done before surgery, etc.
subclass of: Diagnosis

Diarrhea
type: NamedIndividual
type: Symptom
type: Clinical finding (finding)
comment: SCTID: 62315008

Disease
type: Class
comment: SCTID: 64572001
comment: an impairment of health or a condition of abnormal functioning.

Disease caused by Coronaviridae
type: Class
comment: A viral disease caused by coronavirus.
comment: SCTID: 27619001
subclass of: Viral disease
subclass of: Restriction
  on property: covid-19 clinical facility
  some values from: CovidTestingFacility

DiseaseCluster
type: Class
comment: Patients clustered by diseases that made them susceptible to the virus
subclass of: Cluster

District
type: Class
comment: An adminidtrative area spanning regions or counties, several municipalities, subdivisions of municipalities, school district, or political district.
subclass of: Place

District wise statistics
type: Class
subclass of: Statistics

Diu
type: NamedIndividual
type: City
type: Place
contained in: India
geoName: Diu
has country: India
latitude: 20.71
longitude: 70.98

Doctor
type: Class
comment: A licensed medical doctor.
comment: SCTID: 158965000
subclass of: HealthCareProfessional

Doha
type: NamedIndividual
type: City
type: Place
contained in: Qatar
geoName: Doha
has country: Qatar
latitude: 25.286667
longitude: 51.533333

DomesticTravelHistoryAbsentCluster
type: NamedIndividual
type: Cluster
type: GeographicCluster
type: Group
type: Agent
location: India
comment: Domestic Travel History Absent : The patients for whom the information was given as "Travel History-Domestic"

Dry cough
type: NamedIndividual
type: Symptom
type: Clinical finding (finding)
comment: SCTID: 11833005

Dubai
type: NamedIndividual
type: City
type: Place
geoName: Dubai
latitude: 25.263056
longitude: 55.297222

Edinburgh
type: NamedIndividual
type: City
type: Place
contained in: Scotland
contained in: UK
geoName: Edinburgh
has state: Scotland
latitude: 55.953
longitude: -3.189

Exposure to COVID-19
type: Class
comment: Suspected causes of catching COVID-19.

Gathering
type: Class
comment: Mass gathering, a suspected cause for catching COVID-19.
subclass of: Exposure to COVID-19

Fever
type: NamedIndividual
type: Symptom
type: Clinical finding (finding)
comment: SCTID: 386661006

France
type: NamedIndividual
type: Country
type: Place
contains: Paris
geoName: France

Gadag
type: NamedIndividual
type: City
type: Place
contained in: Bengaluru Urban
contained in: India
contained in: Karnataka
geoName: Gadag
has country: India
has state: Karnataka
latitude: 15.4167
longitude: 75.6167

Gadag-Betageri
type: NamedIndividual
type: City
type: Place
contained in: Bengaluru Urban
contained in: India
contained in: Karnataka
geoName: Gadag-Betageri
has country: India
has state: Karnataka
latitude: 15.4167
longitude: 75.6167

GeographicCluster
type: Class
comment: Patients clustered by the geographic region where they contracted the infection
subclass of: Cluster

GeographicRegion
type: Class
comment: Geographic regions such as the Middle East, North America, etc. For the cluster class
subclass of: Place

Germany
type: NamedIndividual
type: Country
type: Place
geoName: Germany

Goa
type: NamedIndividual
type: City
type: Place
geoName: Goa
latitude: 15.5
longitude: 73.83

Greece
type: NamedIndividual
type: Country
type: Place
contains: Athens
geoName: Greece

Group
type: Class
subclass of: Agent

Gujarat
type: NamedIndividual
type: Place
type: State
contained in: India
contains: Ahmedabad
contains: Baroda
contains: Surat
geoName: Gujarat
has country: India
is location for: GujaratCluster

GujaratCluster
type: NamedIndividual
type: Cluster
type: GeographicCluster
type: Group
type: Agent
location: Gujarat
comment: From Gujarat : The patients with travel history to Gujarat and their contacts.

Gulbarga
type: NamedIndividual
type: City
type: District
type: Place
contained in: Bengaluru Urban
contained in: India
contained in: Karnataka
geoName: Gulbarga
has state: Karnataka
latitude: 17.329
longitude: 76.825

Guyana
type: NamedIndividual
type: Country
type: Place
geoName: Guyana
comment: officially the Co‑operative Republic of Guyana, is a country on the northern mainland of South America.

Hacking cough
type: NamedIndividual
type: Symptom
type: Clinical finding (finding)
comment: SCTTID: 59994004

Haryana
type: NamedIndividual
type: Place
type: State
contained in: India
geoName: Haryana
has country: India

Hassan
type: NamedIndividual
type: City
type: Place
contained in: Bengaluru Urban
contained in: India
contained in: Karnataka
geoName: Hassan
has state: Karnataka
latitude: 13.012
longitude: 76.068

Haveri
type: NamedIndividual
type: City
type: Place
contained in: Bengaluru Urban
contained in: India
contained in: Karnataka
geoName: Haveri
has state: Karnataka
latitude: 14.793889
longitude: 75.403889

HealthCareProfessional
type: Class
subclass of: Person

Himachal Pradesh
type: NamedIndividual
type: Place
type: State
contained in: India
geoName: Himachal Pradesh
has country: India

Hindupur
type: NamedIndividual
type: City
type: Place
contained in: Anantapur
contained in: Andhra Pradesh
contained in: India
geoName: Hindupur
has district: Anantapur
latitude: 13.83
longitude: 77.49

Hubballi
type: NamedIndividual
type: City
type: Place
contained in: Bengaluru Urban
contained in: India
contained in: Karnataka
geoName: Hubballi
has state: Karnataka
latitude: 15.350217
longitude: 75.137625

Hubli
type: NamedIndividual
type: City
type: Place
contained in: Bengaluru Urban
contained in: India
contained in: Karnataka
geoName: Hubli
has state: Karnataka
comment: Hubli, officially known as Hubballi, is a city in the Indian state of Karnataka.
latitude: 15.350217
longitude: 75.137625

Humnabad
type: NamedIndividual
type: City
type: Place
contained in: Bengaluru Urban
contained in: Bidar
contained in: India
contained in: Karnataka
geoName: Humnabad
has district: Bidar
comment: a City and municipal council in the Bidar District of the Indian state of Karnataka and city is a headquarters of Humnabad taluk.
latitude: 17.77
longitude: 77.13

Hyderabad
type: NamedIndividual
type: City
type: Place
contained in: India
contained in: Telangana
geoName: Hyderabad
has state: Telangana
latitude: 17.37
longitude: 78.48

Hypertension (HTN)
type: NamedIndividual
type: Comorbidity

India
type: NamedIndividual
type: Country
type: Place
contains: Ahmedabad
contains: Ajmer
contains: Anantapur
contains: Andaman and Nicobar Islands
contains: Andhra Pradesh
contains: Assam
contains: Bagalkote
contains: Bangalore
contains: Bangalore-Urban
contains: Bangalore Rural
contains: Baroda
contains: Belagavi
contains: Bellary
contains: Bellary District
contains: Bhatkal
contains: Bidar
contains: Carwar
contains: Chamarajanagar
contains: Channagiri
contains: Chattisgadh
contains: Chennai
contains: Chikkaballapur
contains: Chitradurga
contains: Dadra And Nagar Haveli And Daman And Diu
contains: Dakshina Kannada District
contains: Daman And Diu
contains: Davangere
contains: Davangere District
contains: Debaspete
contains: Delhi
contains: Dharwad
contains: Dharwad District
contains: Diu
contains: Gadag
contains: Gadag-Betageri
contains: Gujarat
contains: Gulbarga
contains: Haryana
contains: Hassan
contains: Haveri
contains: Himachal Pradesh
contains: Hindupur
contains: Hubballi
contains: Hubli
contains: Humnabad
contains: Hyderabad
contains: Jalgaon
contains: Jalgaon District
contains: Jammu
contains: Jammu And Kashmir
contains: Jharkhand
contains: Kalaburagi
contains: Kalburgi
contains: Karnataka
contains: Karwara
contains: Kashmir
contains: Kerala
contains: Coorg
contains: Kolhapur
contains: Kolkata
contains: Koppal
contains: Koppala District
contains: Madhya Pradesh
contains: Madikeri
contains: Madurai
contains: Madurai District
contains: Maharashtra
contains: Mandya
contains: Mangalore
contains: Mangaluru
contains: Manipur
contains: Mumbai
contains: Mysore
contains: Nagaland
contains: Nandurbar
contains: Nandurbar District
contains: Nanjangud

IndiaStat000001
type: NamedIndividual
type: Country wise statistics
type: Statistics
active: 14759
cases: 14759
cases: 18601
cases: 3252
cases: 590
deceased: 590
is covid-19 statistics of: India
metrics: 14759
metrics: 18601
metrics: 3252
metrics: 590
recovered: 3252

Indonesia
type: NamedIndividual
type: Country
type: Place
geoName: Indonesia

InfectedNeighbor
type: Class
subclass of: Exposure to COVID-19

InfectedNephew
type: Class
subclass of: InfectedFamilyMember

InfectedNiece
type: Class
subclass of: InfectedFamilyMember

InfectedViaHealthcareWork
type: Class
subclass of: InfectedViaJob

InfectedViaJob
type: Class
subclass of: Exposure to COVID-19

InfectedViaPoliceWork
type: Class
subclass of: InfectedViaJob

InfluenzaLikeIllnessCluster
type: NamedIndividual
type: Cluster
type: DiseaseCluster
type: Group
type: Agent
comment: Influenza like illness : The patients showing influenza like symptoms and their contacts.

InternationalTravelHistoryAbsentCluster
type: NamedIndividual
type: Cluster
type: GeographicCluster
type: Group
type: Agent
location: The World
comment: International Travel History Absent : The patients for whom the information was given as "Travel History-International"

Iraq
type: NamedIndividual
type: Country
type: Place
geoName: Iraq
geoName: Republic of Iraq
comment: A country in Western Asia, bordered by Turkey to the north, Iran to the east, Kuwait to the southeast, Saudi Arabia to the south, Jordan to the southwest and Syria to the west.
label: Republic of Iraq

Ireland
type: NamedIndividual
type: Country
type: Place
geoName: Ireland

Ischemic Heart Disease (IHD)
type: NamedIndividual
type: Comorbidity

Italy
type: NamedIndividual
type: Country
type: Place
geoName: Italy

Jalgaon
type: NamedIndividual
type: City
type: Place
contained in: India
contained in: Jalgaon District
contained in: Maharashtra
geoName: Jalgaon
has district: Jalgaon District
latitude: 20.997984
longitude: 75.566711

Jalgaon District
type: NamedIndividual
type: District
type: Place
contained in: India
contained in: Maharashtra
contains: Jalgaon
geoName: Jalgaon District
has state: Maharashtra

Jammu
type: NamedIndividual
type: City
type: Place
contained in: India
contained in: Jammu And Kashmir
geoName: Jammu
has state: Jammu And Kashmir
comment: Jammu is the winter capital and the largest city in Jammu district of the Indian union territory of Jammu and Kashmir.
latitude: 32.73
longitude: 74.87

Jammu And Kashmir
type: NamedIndividual
type: UnionTerritory
type: Place
type: State
contained in: India
contains: Jammu
geoName: Jammu And Kashmir
has country: India

Jeddah
type: NamedIndividual
type: City
type: Place
contained in: Saudi Arabia
geoName: Jeddah
has country: Saudi Arabia
latitude: 21.543333
longitude: 39.172778

Jharkhand
type: NamedIndividual
type: Place
type: State
contained in: India
contains: Shikharaji
geoName: Jharkhand
has country: India

June-27TraceHistoryAbsentCluster
type: NamedIndividual
type: Cluster
type: Group
type: TimeCluster
type: Agent
date: 2020-06-27T00:00:00
event date: 2020-06-27T00:00:00
comment: 27-June Trace History Absent : On this day, no trace history information was given for the patients. Patients who were contacts of these individuals are also in this cluster.

June-28TraceHistoryAbsentCluster
type: NamedIndividual
type: Cluster
type: Group
type: TimeCluster
type: Agent
date: 2020-06-28T00:00:00
event date: 2020-06-28T00:00:00
comment: 28-June Trace History Absent : On this day, no trace history information was given for the patients. Patients who were contacts of these individuals are also in this cluster.

June-29TraceHistoryAbsentCluster
type: NamedIndividual
type: Cluster
type: Group
type: TimeCluster
type: Agent
date: 2020-06-29T00:00:00
event date: 2020-06-29T00:00:00
comment: 29-June Trace History Absent : On this day, no trace history information was given for the patients. Patients who were contacts of these individuals are also in this cluster.

Kalaburagi
type: NamedIndividual
type: City
type: District
type: Place
contained in: Bengaluru Urban
contained in: India
contained in: Karnataka
geoName: Kalaburagi
has state: Karnataka
latitude: 17.329
longitude: 76.825

Kalburgi
type: NamedIndividual
type: City
type: District
type: Place
contained in: Bengaluru Urban
contained in: India
contained in: Karnataka
geoName: Kalburgi
has state: Karnataka
latitude: 17.329
longitude: 76.825

Karnataka
type: NamedIndividual
type: Place
type: State
contained in: Bengaluru Urban
contained in: India
contains: Bagalkote
contains: Bangalore
contains: Bangalore-Urban
contains: Bangalore Rural
contains: Belagavi
contains: Bellary
contains: Bellary District
contains: Bhatkal
contains: Bidar
contains: Carwar
contains: Chamarajanagar
contains: Channagiri
contains: Chikkaballapur
contains: Chitradurga
contains: Davangere
contains: Davangere District
contains: Dharwad
contains: Dharwad District
contains: Gadag
contains: Gadag-Betageri
contains: Gulbarga
contains: Hassan
contains: Haveri
contains: Hubballi
contains: Hubli
contains: Humnabad
contains: Kalaburagi
contains: Kalburgi
contains: Karwara
contains: Coorg
contains: Koppal
contains: Koppala District
contains: Madikeri
contains: Mandya
contains: Mangalore
contains: Mangaluru
contains: Mysore
contains: Nanjangud
contains: Nelamangala
contains: Pharmaceutical Company In Nanjangud
contains: Raichore
contains: Ramanagara
contains: Ramanagara District
contains: Shahapur
contains: Shivamogga
contains: Tumkur
contains: Udupi
contains: Uttar Kannada
contains: North Canara
contains: Vijayapura
contains: Yadgir
geoName: Karnataka
has country: India
has statistics: karntStateStat000001
has statistics: karntStateStat000002
is location for: COVID-19
state wise statistics: karntStateStat000001
state wise statistics: karntStateStat000002

Karwara
type: NamedIndividual
type: City
type: District
type: Place
contained in: Bengaluru Urban
contained in: India
contained in: Karnataka
geoName: Karwara
has state: Karnataka

Kashmir
type: NamedIndividual
type: GeographicRegion
type: Place
contained in: India
geoName: Kashmir
has country: India

Kerala
type: NamedIndividual
type: Place
type: State
contained in: India
contains: Trivandrum
geoName: Kerala
has country: India

Coorg
type: NamedIndividual
type: District
type: Place
contained in: Bengaluru Urban
contained in: India
contained in: Karnataka
contains: Madikeri
geoName: Coorg
geoName: Kodagu
has state: Karnataka
comment: Kodagu, also called Coorg, is a district in Karnataka State.
label: Kodagu

Kodagu District
type: NamedIndividual
type: District
type: Place
geoName: Kodagu District

Kolhapur
type: NamedIndividual
type: City
type: Place
contained in: India
contained in: Maharashtra
geoName: Kolhapur
has state: Maharashtra
latitude: 16.691667
longitude: 74.233333

Kolkata
type: NamedIndividual
type: City
type: Place
contained in: India
contained in: West Bengal
geoName: Kolkata
has state: West Bengal
latitude: 22.5726
longitude: 88.3639

Koppal
type: NamedIndividual
type: City
type: Place
contained in: Bengaluru Urban
contained in: India
contained in: Karnataka
contained in: Koppala District
geoName: Koppal
geoName: Koppala
has district: Koppala District
comment: a city in Koppala district in the Indian state of Karnataka.
label: Koppala
latitude: 15.35
longitude: 76.15

Koppala District
type: NamedIndividual
type: District
type: Place
contained in: Bengaluru Urban
contained in: India
contained in: Karnataka
contains: Koppal
geoName: Koppala District
has state: Karnataka

Kuwait
type: NamedIndividual
type: Country
type: Place
geoName: Kuwait

Laboratory test finding
type: Class
comment: SCTID: 118246004
comment: The laboratory test finding of the patient. The possible values are Positive, Negative, Pending.
subclass of: Test result
equivalent class: Class
  one of: Negative
  one of: Pending
  one of: Positive

London
type: NamedIndividual
type: City
type: Place
contained in: UK
geoName: London
has country: UK
latitude: 51.507222
longitude: -0.1275

Madhya Pradesh
type: NamedIndividual
type: Place
type: State
contained in: India
geoName: Madhya Pradesh
has country: India

Madikeri
type: NamedIndividual
type: City
type: Place
contained in: Bengaluru Urban
contained in: India
contained in: Karnataka
contained in: Coorg
geoName: Madikeri
has district: Coorg
latitude: 12.4209
longitude: 75.7397

Madrid
type: NamedIndividual
type: City
type: Place
contained in: Spain
geoName: Madrid
has country: Spain
latitude: 40.416667
longitude: -3.716667

Madurai
type: NamedIndividual
type: City
type: Place
contained in: India
contained in: Madurai District
contained in: Tamil Nadu
geoName: Madurai
has district: Madurai District
latitude: 9.9
longitude: 78.1

Madurai District
type: NamedIndividual
type: District
type: Place
contained in: India
contained in: Tamil Nadu
contains: Madurai
geoName: Madurai District
has state: Tamil Nadu

Maharashtra
type: NamedIndividual
type: Place
type: State
contained in: India
contains: Jalgaon
contains: Jalgaon District
contains: Kolhapur
contains: Mumbai
contains: Nandurbar
contains: Nandurbar District
contains: Palghar
contains: Panvel
contains: Pune
contains: Raigad
contains: Ratnagiri
contains: Ratnagiri District
contains: Solapur
contains: Thane
contains: Thane District
geoName: Maharashtra
has country: India
is location for: MaharashtraCluster

MaharashtraCluster
type: NamedIndividual
type: Cluster
type: GeographicCluster
type: Group
type: Agent
location: Maharashtra
comment: From Maharashtra : The patients with travel history to Maharashtra and their contacts.

Malaysia
type: NamedIndividual
type: Country
type: Place
geoName: Malaysia

Man
type: Class
comment: A man.
subclass of: Person
equivalent class: Class
  intersection of: Person
  intersection of: Restriction
    has value: Male
    on property: has gender

Mandya
type: NamedIndividual
type: City
type: Place
contained in: Bengaluru Urban
contained in: India
contained in: Karnataka
geoName: Mandya
has state: Karnataka
latitude: 12.52
longitude: 76.9

Mangalore
type: NamedIndividual
type: City
type: Place
contained in: Bengaluru Urban
contained in: Dakshina Kannada District
contained in: India
contained in: Karnataka
geoName: Mangalore
has district: Dakshina Kannada District
has state: Karnataka
latitude: 12.78563
longitude: 74.84108

Mangaluru
type: NamedIndividual
type: City
type: Place
contained in: Bengaluru Urban
contained in: Dakshina Kannada District
contained in: India
contained in: Karnataka
geoName: Mangaluru
has district: Dakshina Kannada District
has state: Karnataka
latitude: 12.78563
longitude: 74.84108

Manipur
type: NamedIndividual
type: Place
type: State
contained in: India
geoName: Manipur
has country: India

Mecca
type: NamedIndividual
type: City
type: Place
contained in: Saudi Arabia
geoName: Mecca
has country: Saudi Arabia
latitude: 21.4225
longitude: 39.823333

Middle East
type: NamedIndividual
type: GeographicRegion
type: Place
geoName: Middle East
is location for: MiddleEastCluster

MiddleEastCluster
type: NamedIndividual
type: Cluster
type: GeographicCluster
type: Group
type: Agent
location: Middle East
comment: From Middle East : The patients with travel to the Middle East and their contacts.

Mild and very mild COVID-19
type: Class
comment: Cases presenting with fever and/or upper respiratory tract illness (Influenza Like Illness, ILI).
subclass of: COVID-19 Diagnosis

Moderate COVID-19
type: Class
comment: Pneumonia with no signs of severe disease (Respiratory Rate 15 to 30/minute, SpO2 90%-94%).
subclass of: COVID-19 Diagnosis

Mumbai
type: NamedIndividual
type: City
type: Place
contained in: India
contained in: Maharashtra
geoName: Mumbai
has state: Maharashtra
latitude: 18.975
longitude: 72.825833

Muscat
type: NamedIndividual
type: City
type: Place
contained in: Oman
geoName: Muscat
has country: Oman
latitude: 23.588889
longitude: 58.408333

Mysore
type: NamedIndividual
type: District
type: Place
contained in: Bengaluru Urban
contained in: India
contained in: Karnataka
contains: Nanjangud
contains: Pharmaceutical Company In Nanjangud
geoName: Mysore
has state: Karnataka

Nagaland
type: NamedIndividual
type: Place
type: State
contained in: India
geoName: Nagaland
has country: India

Nandurbar
type: NamedIndividual
type: City
type: Place
contained in: India
contained in: Maharashtra
contained in: Nandurbar District
geoName: Nandurbar
has district: Nandurbar District
latitude: 21.37
longitude: 74.25

Nandurbar District
type: NamedIndividual
type: District
type: Place
contained in: India
contained in: Maharashtra
contains: Nandurbar
geoName: Nandurbar District
has state: Maharashtra

Nanjangud
type: NamedIndividual
type: City
type: Place
contained in: Bengaluru Urban
contained in: India
contained in: Karnataka
contained in: Mysore
contains: Pharmaceutical Company In Nanjangud
geoName: Nanjangud
has district: Mysore
latitude: 12.12
longitude: 76.68

Nasal congestion
type: NamedIndividual
type: Symptom
type: Clinical finding (finding)
comment: SCTID: 68235000

Nelamangala
type: NamedIndividual
type: City
type: Place
contained in: Bangalore Rural
contained in: Bengaluru Urban
contained in: India
contained in: Karnataka
geoName: Nelamangala
has district: Bangalore Rural
latitude: 13.102
longitude: 77.374

Nepal
type: NamedIndividual
type: Country
type: Place
geoName: Nepal

Netherlands
type: NamedIndividual
type: Country
type: Place
contains: Amsterdam
geoName: Netherlands

New York City
type: NamedIndividual
type: City
type: Place
contained in: New York State
contained in: USA
geoName: New York City
has state: New York State
latitude: 40.71274
longitude: -74.005974

New York State
type: NamedIndividual
type: Place
type: State
contained in: USA
contains: New York City
geoName: New York State
has country: USA

Not reported
type: NamedIndividual
type: Comorbidity

Nurse
type: Class
comment: A health professional skilled in caring for young children or the sick (usually under the supervision of a physician).
comment: SCTID: 106292003
label: Professional nurse
subclass of: HealthCareProfessional

Oman
type: NamedIndividual
type: Country
type: Place
contains: Muscat
geoName: Oman

OthersCluster
type: NamedIndividual
type: Cluster
type: Group
type: Agent
comment: Others : The patients who had interdistrict travel in Karnataka, travel to countries / states, healthcare workers and policemen on COVID-19 duty and their contacts. The numbers for these reasons were too few to form separate clusters.

P000001-Vitals1
type: NamedIndividual
type: TestData
type: Test result
type: Vital signs
Heart rate: 120
is test result for: p000001
respiratory rate: 10

P000002-Vitals1
type: NamedIndividual
type: TestData
type: Test result
type: Vital signs
date: 2020-04-26T09:00:00
is test result for: p000002
respiratory rate: 15
test result on: 2020-04-26T09:00:00

P000002Diagnosis
type: NamedIndividual
type: COVID-19 Diagnosis
type: Diagnosis
type: Moderate COVID-19
type: TestData
type: Untested for COVID-19
type: Agent
type: Person
had covid test: false
is diagnosis of: p000002

P000003-Vitals1
type: NamedIndividual
type: TestData
type: Test result
type: Vital signs
peripheral capillary oxygen saturation(SpO2): 90
date: 2020-04-21T10:00:00
is test result for: p000003
next test result: P000003-Vitals2
respiratory rate: 35
test result on: 2020-04-21T10:00:00

P000003-Vitals2
type: NamedIndividual
type: TestData
type: Test result
type: Vital signs
date: 2020-04-22T10:00:00
is test result for: p000003
next test result: P000003-Vitals3
previous test result: P000003-Vitals1
test result on: 2020-04-22T10:00:00

P000003-Vitals3
type: NamedIndividual
type: TestData
type: Test result
type: Vital signs
date: 2020-04-23T11:00:00
is test result for: p000003
next test result: P000003-Vitals4
previous test result: P000003-Vitals2
test result on: 2020-04-23T11:00:00

P000003-Vitals4
type: NamedIndividual
type: TestData
type: Test result
type: Vital signs
peripheral capillary oxygen saturation(SpO2): 90
date: 2020-04-26T08:00:00
is test result for: p000003
previous test result: P000003-Vitals3
respiratory rate: 35
test result on: 2020-04-26T08:00:00

Pain
type: NamedIndividual
type: Symptom
type: Clinical finding (finding)
comment: SCTID: 22253000

Pain in throat
type: NamedIndividual
type: Symptom
type: Clinical finding (finding)
comment: SCTID: 162397003
label: Sore throat

Palghar
type: NamedIndividual
type: Town
type: Place
contained in: India
contained in: Maharashtra
geoName: Palghar
has state: Maharashtra

Panvel
type: NamedIndividual
type: City
type: Place
contained in: India
contained in: Maharashtra
contained in: Raigad
geoName: Panvel
has district: Raigad
comment: a locality in Raigad district of Maharashtra in India.
latitude: 18.994444
longitude: 73.113889

Paris
type: NamedIndividual
type: City
type: Place
contained in: France
geoName: Paris
has country: France
latitude: 48.856613
longitude: 2.352222

Pharmaceutical Company In Nanjangud
type: NamedIndividual
type: Business
type: Group
type: Agent
type: Organization
type: Place
contained in: Bengaluru Urban
contained in: India
contained in: Karnataka
contained in: Mysore
contained in: Nanjangud
has city: Nanjangud
is location for: PharmaceuticalCompanyInNanjangudCluster

PharmaceuticalCompanyInNanjangudCluster
type: NamedIndividual
type: Cluster
type: ContactCluster
type: Group
type: Agent
location: Pharmaceutical Company In Nanjangud
comment: Pharmaceutical Company in Nanjangud : This patients who were workers of a Pharmaceutical Company in Nanjangud, Mysore along with their contacts.

Philippines
type: NamedIndividual
type: Country
type: Place
geoName: Philippines

PolicePerson
type: Class
subclass of: Person

PreSurgeryTest
type: Class
comment: The patient was discovered to have another disease as the result of tests given before surgery.
subclass of: DiagnosisType

PregnancyScreening
type: Class
comment: The patient was discovered to have a disease as a result of tests given during pregnancy.
subclass of: DiagnosisType

Province
type: Class
subclass of: Place

Pune
type: NamedIndividual
type: City
type: Place
contained in: India
contained in: Maharashtra
geoName: Pune
has state: Maharashtra
latitude: 18.520278
longitude: 73.856667

Punjab
type: NamedIndividual
type: GeographicRegion
type: Place
geoName: Punjab

Qatar
type: NamedIndividual
type: Country
type: Place
contains: Doha
geoName: Qatar

Raichore
type: NamedIndividual
type: City
type: District
type: Place
contained in: Bengaluru Urban
contained in: India
contained in: Karnataka
geoName: Raichore
geoName: Raichur
has state: Karnataka
comment: a city municipality in the district of Raichur in the Indian state of Karnataka.
label: Raichur
alternative label: Rayachuru
latitude: 16.2
longitude: 77.37

Raigad
type: NamedIndividual
type: District
type: Place
contained in: India
contained in: Maharashtra
contains: Panvel
geoName: Raigad
geoName: Raigadh
has state: Maharashtra
comment: Raigad District (formerly Kolába district), is a district in the Konkan division of Maharashtra, India.
label: Raigadh

Rajasthan
type: NamedIndividual
type: Place
type: State
contained in: India
contains: Ajmer
geoName: Rajasthan
has country: India
is location for: RajasthanCluster

RajasthanCluster
type: NamedIndividual
type: Cluster
type: GeographicCluster
type: Group
type: Agent
location: Rajasthan
comment: From Rajasthan : The patients with travel history to Rajasthan and their contacts.

Ramanagara
type: NamedIndividual
type: City
type: Place
contained in: Bengaluru Urban
contained in: India
contained in: Karnataka
contained in: Ramanagara District
geoName: Ramanagara
has district: Ramanagara District
comment: a city and a city municipal council in the Indian state of Karnataka.
latitude: 12.723
longitude: 77.286

Ramanagara District
type: NamedIndividual
type: District
type: Place
contained in: Bengaluru Urban
contained in: India
contained in: Karnataka
contains: Ramanagara
geoName: Ramanagara District
has state: Karnataka

Ratnagiri
type: NamedIndividual
type: City
type: Place
contained in: India
contained in: Maharashtra
contained in: Ratnagiri District
geoName: Ratnagiri
has district: Ratnagiri District
latitude: 16.994444
longitude: 73.3

Ratnagiri District
type: NamedIndividual
type: District
type: Place
contained in: India
contained in: Maharashtra
contains: Ratnagiri
geoName: Ratnagiri District
has state: Maharashtra

Rest Of Europe
type: NamedIndividual
type: GeographicRegion
type: Place
geoName: Rest Of Europe
is location for: RestOfEuropeCluster

RestOfEuropeCluster
type: NamedIndividual
type: Cluster
type: GeographicCluster
type: Group
type: Agent
location: Rest Of Europe
comment: From the rest of Europe : The patients with travel history to Europe but not to UK and their contacts.

Riyadh
type: NamedIndividual
type: City
type: Place
contained in: Saudi Arabia
geoName: Riyadh
has country: Saudi Arabia
latitude: 24.633333
longitude: 46.716667

Nasal discharge presen
type: NamedIndividual
type: Symptom
type: Clinical finding (finding)
comment: SCTID: 267101005
label: Nose dripping
label: Nose running

Saudi Arabia
type: NamedIndividual
type: Country
type: Place
contains: Dammam
contains: Jeddah
contains: Mecca
contains: Riyadh
geoName: Saudi Arabia

Scotland
type: NamedIndividual
type: Place
type: State
contained in: UK
contains: Edinburgh
geoName: Scotland
has country: UK

SecondGenerationContactAbsentCluster
type: NamedIndividual
type: Cluster
type: ContactCluster
type: Group
type: Agent
comment: Second Generation Contact Absent : The patients whose information was given as "Contact" without giving the patient ID of the individual they were a contact of.

SecondGenerationContactCluster
type: NamedIndividual
type: Cluster
type: ContactCluster
type: Group
type: Agent

SecondaryContact
type: Class
subclass of: Exposure to COVID-19

SecurityGuard
type: Class
subclass of: Person

SevereAcuteRespiratoryInfectionCluster
type: NamedIndividual
type: Cluster
type: DiseaseCluster
type: Group
type: Agent
comment: Severe Acute Respiratory Infection: This includes patients with a history of Severe Acute Respiratory Infection whose symptoms have resurfaced and their contacts.

Severe COVID-19
type: Class
comment: Severe Pneumonia (with respiratory rate ≥30/minute and/or SpO2 < 90% in room air) or ARDS or Septic shock.
subclass of: COVID-19 Diagnosis

Shahapur
type: NamedIndividual
type: City
type: Place
contained in: Bengaluru Urban
contained in: India
contained in: Karnataka
contained in: Yadgir
geoName: Shahapur
has district: Yadgir
comment: a city and taluka headquarter located in the Yadgir district of Indian state of Karnataka.
latitude: 16.7
longitude: 76.83

Sharjah
type: NamedIndividual
type: City
type: Place
contained in: United Arab Emirates
geoName: Sharjah
has country: United Arab Emirates
latitude: 25.3575
longitude: 55.390833

Shikharaji
type: NamedIndividual
type: City
type: Place
contained in: India
contained in: Jharkhand
geoName: Shikharaji
has state: Jharkhand
latitude: 23.9611
longitude: 86.1371

Shivamogga
type: NamedIndividual
type: City
type: Place
contained in: Bengaluru Urban
contained in: India
contained in: Karnataka
geoName: Shivamogga
has state: Karnataka
latitude: 13.933333
longitude: 75.566667

Singapore
type: NamedIndividual
type: City
type: Place
geoName: Singapore
latitude: 1.283333
longitude: 103.833333

Sneezing
type: NamedIndividual
type: Symptom
type: Clinical finding (finding)
comment: SCTID: 76067001

Solapur
type: NamedIndividual
type: City
type: Place
contained in: India
contained in: Maharashtra
geoName: Solapur
has state: Maharashtra
latitude: 17.68
longitude: 75.92

Republic of South Africa
type: NamedIndividual
type: Country
type: Place
geoName: Republic of South Africa

South America
type: NamedIndividual
type: GeographicRegion
type: Place
geoName: South America
is location for: SouthAmericaCluster

SouthAmericaCluster
type: NamedIndividual
type: Cluster
type: GeographicCluster
type: Group
type: Agent
location: South America
comment: From South America : The patients with travel history to South America and their contacts.

SouthernStatesCluster
type: NamedIndividual
type: Cluster
type: GeographicCluster
type: Group
type: Agent
location: Southern States Of India
comment: From the Southern States : The patients with travel to Kerala, Tamil Nadu, Andhra Pradesh or Telengana and their contacts. This doesn't contain patients with interdistrict travel in Karnataka

Southern States Of India
type: NamedIndividual
type: GeographicRegion
type: Place
geoName: Southern States Of India
is location for: SouthernStatesCluster
comment: Kerala, Tamil Nadu, Andhra Pradesh or Telengana. This doesn't contain Karnataka

peripheral capillary oxygen saturation(SpO2)
type: DatatypeProperty
type: FunctionalProperty
comment: The peripheral capillary oxygen saturation, an estimate (in %) of the amount of oxygen in the blood.
domain: Vital signs
range: integer

Spain
type: NamedIndividual
type: Country
type: Place
contains: Madrid
geoName: Spain

Sri Lanka
type: NamedIndividual
type: Country
type: Place
contains: Colombo
contains: Western Province
geoName: Sri Lanka

State wise statistics
type: Class
subclass of: Statistics

Statistics
type: Class
comment: Statistics based on each day.
comment: Statistics of COVID-19 cases which includes the deatils of active, recovered, deaths, and also the resources (e.g., beds required, shortage of beds, ICUs) on daily basis.

Status
type: Class
comment: The current status of the patient, for example: recovered, hospitalized, deceased.
equivalent class: Class
  one of: Cured
  one of: Deceased
  one of: Hospitalized

Surat
type: NamedIndividual
type: City
type: Place
contained in: Gujarat
contained in: India
geoName: Surat
has state: Gujarat
latitude: 21.17024
longitude: 72.831061

Switzerland
type: NamedIndividual
type: Country
type: Place
geoName: Switzerland

TJCongregation13thTo18thCluster
type: NamedIndividual
type: Cluster
type: GeographicCluster
type: Group
type: TimeCluster
type: Agent
date: 2020-03-13T00:00:00
date: 2020-03-18T00:00:00
end date: 2020-03-18T00:00:00
location: Delhi
start date: 2020-03-13T00:00:00
comment: TJ Congregation from 13th to 18th March in Delhi : The patients with travel history to the TJ Congregation in Delhi and their contacts.

Tamil Nadu
type: NamedIndividual
type: Place
type: State
contained in: India
contains: Chennai
contains: Madurai
contains: Madurai District
contains: Vellore
contains: Vellore District
geoName: Tamil Nadu
has country: India

Telangana
type: NamedIndividual
type: Place
type: State
contained in: India
contains: Hyderabad
geoName: Telangana
has country: India

Test result
type: Class
comment: A test result.

Texas
type: NamedIndividual
type: Place
type: State
contained in: USA
geoName: Texas
has country: USA

Thane
type: NamedIndividual
type: City
type: Place
contained in: India
contained in: Maharashtra
contained in: Thane District
geoName: Thane
has district: Thane District
latitude: 19.172431
longitude: 72.957019

Thane District
type: NamedIndividual
type: District
type: Place
contained in: India
contained in: Maharashtra
contains: Thane
geoName: Thane District
has state: Maharashtra

The World
type: NamedIndividual
type: GeographicRegion
type: Place
geoName: The World
is location for: InternationalTravelHistoryAbsentCluster
comment: Represents the geographic region of the entire world.

TimeCluster
type: Class
comment: A cluster defined by some event (including lack of knowledge) at a certain date. Note that clusters are not disjoint, so a cluster can be an instance of a TimeCluster and other clusters.
subclass of: Cluster

Feeling tired
type: NamedIndividual
type: Symptom
type: Clinical finding (finding)
comment: SCTID: 224960004

Town
type: Class
comment: Places which satisfy the following criteria are called towns: (i) A minimum population of 5,000; (ii) At least 75 per cent of the male main working population engaged in non-agricultural pursuits; and (iii) A density of population of at least 400 persons per sq. km. (i.e. 1000 per sq. Mile).
subclass of: Place

Trivandrum
type: NamedIndividual
type: City
type: Place
contained in: India
contained in: Kerala
geoName: Trivandrum
has state: Kerala
latitude: 8.4875
longitude: 76.9525

Tumkur
type: NamedIndividual
type: City
type: Place
contained in: Bengaluru Urban
contained in: India
contained in: Karnataka
geoName: Tumkur
has state: Karnataka
latitude: 13.34
longitude: 77.1

Turkey
type: NamedIndividual
type: Country
type: Place
geoName: Turkey

UK
type: NamedIndividual
type: Country
type: Place
contains: Edinburgh
contains: London
contains: Scotland
geoName: UK
is location for: UnitedKingdomCluster

UP
type: NamedIndividual
type: Place
type: State
contained in: India
geoName: UP
has country: India
has statistics: Bengalure Urban
has statistics: upStatState000002
is location for: COVID-19
state wise statistics: Bengalure Urban
state wise statistics: upStatState000002
name: Uttar Pradesh

URTI
type: NamedIndividual
type: Symptom
type: Clinical finding (finding)
comment: SCTID: 54150009
label: Upper Respiratory Tract Infection

USA
type: NamedIndividual
type: Country
type: Place
contains: New York City
contains: New York State
contains: Texas
geoName: USA
is location for: USACluster

USACluster
type: NamedIndividual
type: Cluster
type: GeographicCluster
type: Group
type: Agent
location: USA
comment: From USA : The patients who had travel history to USA and their contacts.

Udupi
type: NamedIndividual
type: City
type: Place
contained in: Bengaluru Urban
contained in: India
contained in: Karnataka
geoName: Udupi
has state: Karnataka
latitude: 13.3389
longitude: 74.7451

UnderTracing
type: Class
comment: The patient was identified as at risk for the disease (e.g., Covid-19) and was tested as part of tracing people identified to be at risk.
subclass of: DiagnosisType

UnionTerritory
type: Class
comment: A union territory ('Federally administered territory/province') is a type of administrative division in the Republic of India. Unlike the states of India, which have their own governments, union territories are federal territories governed directly by the Central Government of India.
subclass of: Place

United Arab Emirates
type: NamedIndividual
type: Country
type: Place
contains: Sharjah
geoName: United Arab Emirates

UnitedKingdomCluster
type: NamedIndividual
type: Cluster
type: GeographicCluster
type: Group
type: Agent
location: UK
comment: From United Kingdom : The patients with travel history to UK and their contacts.

UnknownCluster
type: NamedIndividual
type: Cluster
type: Group
type: Agent
comment: Unknown : The patients who have been listed in the Media Bulletins as "Contact Under Tracing"and their contacts.

Untested for COVID-19
type: Class
comment: Untested for COVID-19
subclass of: Person
equivalent class: Class
  intersection of: Person
  intersection of: Restriction
    has value: false
    on property: hadCovidTest

UrgentlyNeedsCovidTest
type: Class
comment: Urgently needs COVID test
comment: Urgently needs COVID-19 test
subclass of: Untested for COVID-19
equivalent class: Class
  intersection of: Person
  intersection of: Restriction
    on property: hasCloseRelationship
    some values from: Diagnosed With COVID-19
  intersection of: Restriction
    has value: false
    on property: hadCovidTest

Uttar Kannada
type: NamedIndividual
type: District
type: Place
contained in: Bengaluru Urban
contained in: India
contained in: Karnataka
geoName: Uttar Kannada
has state: Karnataka

Uttar Pradesh
type: NamedIndividual
type: Place
type: State
geoName: Uttar Pradesh

North Canara
type: NamedIndividual
type: District
type: Place
contained in: Bengaluru Urban
contained in: India
contained in: Karnataka
geoName: North Canara
geoName: Uttara Kannada
has state: Karnataka
comment: Uttara Kannada, formerly known as North Canara, is a district in the Indian state of Karnataka.
label: Uttara Kannada

Vadodara District
type: NamedIndividual
type: District
type: Place
geoName: Vadodara District

Vellore
type: NamedIndividual
type: City
type: Place
contained in: India
contained in: Tamil Nadu
contained in: Vellore District
geoName: Vellore
has district: Vellore District
latitude: 12.920219
longitude: 79.133306

Vellore District
type: NamedIndividual
type: District
type: Place
contained in: India
contained in: Tamil Nadu
contains: Vellore
geoName: Vellore District
has state: Tamil Nadu

Vijayapura
type: NamedIndividual
type: City
type: Place
contained in: Bengaluru Urban
contained in: India
contained in: Karnataka
geoName: Vijayapura
has state: Karnataka
latitude: 13.29
longitude: 77.8

Viral disease
type: Class
comment: SCTID: 34014006
subclass of: Infectious disease

Vishakapatnam
type: NamedIndividual
type: City
type: Place
contained in: Andhra Pradesh
contained in: India
geoName: Vishakapatnam
has state: Andhra Pradesh
latitude: 17.704167
longitude: 83.297778

Vital signs
type: Class
comment: The vital signs of a suspected covid-19 patient as found through clinical tests.
subclass of: Test result

Ward 135
type: NamedIndividual
type: CityWard
type: Place
geoName: Ward 135

West Bengal
type: NamedIndividual
type: Place
type: State
contained in: India
contains: Kolkata
geoName: West Bengal
has country: India

Western Province
type: NamedIndividual
type: Province
type: Place
contained in: Sri Lanka
contains: Colombo
geoName: Western Province
has country: Sri Lanka
comment: is one of the nine provinces of Sri Lanka, the first level administrative division of the country.

Woman
type: Class
comment: A women.
subclass of: Person
equivalent class: Class
  intersection of: Person
  intersection of: Restriction
    has value: Female
    on property: has gender

Yadgir
type: NamedIndividual
type: District
type: Place
contained in: Bengaluru Urban
contained in: India
contained in: Karnataka
contains: Shahapur
geoName: Yadgir
has state: Karnataka

acronym
type: DatatypeProperty
comment: An acronym.
range: string

active
type: DatatypeProperty
comment: Number of active covid cases.
domain: Statistics
range: integer
sub property of: cases

admitted in
type: ObjectProperty
comment: The patient admitted to the covid-19 dedicated facilities, like home, hotel, hospital, etc.
domain: Patient
range: COVID-19 dedicated facility
inverse of: hasAdmittedPatient

admitted on
type: DatatypeProperty
comment: A patient admitted on a particular day and time.
domain: Patient
label: date of admission
range: dateTime
sub property of: date

age
type: DatatypeProperty
type: FunctionalProperty
comment: An age of a person.
domain: Person
range: decimal

area
type: DatatypeProperty
type: FunctionalProperty
comment: Tthe extent of a 2-dimensional surface enclosed within a boundary (in sq. km.).
domain: Place
range: decimal

no. of bed shortage
type: DatatypeProperty
comment: no. of bed shortage.
domain: Statistics
range: integer
sub property of: resource

no. of beds needed
type: DatatypeProperty
comment: no. of beds needed.
domain: Statistics
range: integer
sub property of: resource

cases
type: DatatypeProperty
comment: Number of covid cases.
domain: Statistics
range: integer
sub property of: metrics

clinical facility
type: ObjectProperty
comment: The medical clinic where testing/ diagnosis for disease is available.
domain: Disease
range: Medical clinic

co-worker
type: ObjectProperty
type: SymmetricProperty
comment: Two persons in co-worker relation.
domain: Person
range: Person
sub property of: has relationships

comorbidity
type: ObjectProperty
domain: Patient
range: Comorbidity
sub property of: topObjectProperty

contained in
type: ObjectProperty
type: TransitiveProperty
comment: Indicates a place has a place part.
domain: Class
  union of: Agent
  union of: Place
range: Place
inverse of: contains

contains
type: ObjectProperty
type: TransitiveProperty
comment: A place is part of another place.

contracted virus from
type: ObjectProperty
comment: In case the patient contracted the virus from is known, this property mentions the case number of the "parent" [source: https://www.isibang.ac.in/~athreya/incovid19/data.html]
domain: Agent
range: Agent
inverse of: passedVirusTo

country code
type: DatatypeProperty
comment: The country code. Example, "IND" for India.
domain: Country
range: string

country wise statistics
type: ObjectProperty
comment: A property to connect to the country wise metrics related to the casualities of the disease.
domain: Country
range: Country wise statistics
sub property of: has statistics

covid-19 clinical facility
type: ObjectProperty
comment: The medical clinic where testing/ diagnosis for the COVID-19 Coronavirus disease is available.
domain: Disease caused by Coronaviridae
range: CovidTestingFacility
sub property of: clinical facility

covid-19 case on
type: DatatypeProperty
comment: covid-19 cases on a day
domain: Statistics
range: dateTime
sub property of: date

currentResident
type: ObjectProperty
comment: The Place (typically a City but could be a building, state, etc.) where a Person currently lives
domain: Person
range: Place
sub property of: topObjectProperty
inverse of: isCurrentResidentOf

daily increased cases
type: DatatypeProperty
comment: Total no,. of active cases in Date 2 - total no. of active cases in Date 1
domain: Statistics
range: integer
sub property of: cases

date
type: DatatypeProperty
comment: A particular day specified as the time something happens.
range: dateTime

deceased
type: DatatypeProperty
comment: number of deceased covid-19 patients.
domain: Statistics
range: integer
sub property of: cases

diagnosed on
type: DatatypeProperty
comment: The diagnosis took place on a day.
domain: Diagnosis
range: dateTime
sub property of: date
alternative label: tested positive on

district wise patient ID
type: DatatypeProperty
type: FunctionalProperty
comment: The patient ID assigned at the district level (usually a first level of administrative division within a state/ province).
range: string
sub property of: case id

district wise statistics
type: ObjectProperty
comment: A property to connect to the district wise metrics related to the casualities of the disease.
domain: District
range: District wise statistics
sub property of: has statistics

geoName
type: DatatypeProperty
comment: Removed data type xsd:string from range for now. Because I copied the values over from the labels using SPARQL the annotations for the language ("
comment: A utility string to be used together with a Full Text Index in Allegro to facilitate processing reasonStrings with names of Places
domain: Place
sub property of: topDataProperty

hasAunt
type: ObjectProperty
comment: The sister of your father or mother; the wife of your uncle.
sub property of: kinswomen

hasBrother
type: ObjectProperty
comment: A male with the same parents as someone else.
domain: Person
sub property of: hasSibling
sub property of: kinsman

has caused any secondary infections
type: DatatypeProperty
comment: This indiicates the the secondary infections caused, if any. The values are either "yes", "no" and indicate if the patient has caused any [known] secondary infections [source: https://www.isibang.ac.in/~athreya/incovid19/data.html].
domain: Patient
range: boolean

has city
type: ObjectProperty
range: City
sub property of: contained in

has country
type: ObjectProperty
range: Country
sub property of: contained in

has diagnosis
type: ObjectProperty
comment: The diagnosis details of a patient.
domain: Patient
range: Diagnosis
inverse of: is diagnosis of

has district
type: ObjectProperty
range: District
sub property of: contained in

domestic help
type: ObjectProperty
comment: A person is a domestic help to anothe person.
domain: Person
range: Person
sub property of: hasCloseRelationship
inverse of: isDomesticHelpFor

hasHusband
type: ObjectProperty
domain: Woman
range: Man
sub property of: spouse
inverse of: hasWife

case id
type: DatatypeProperty
range: string

location
type: ObjectProperty
comment: The location of for example where a person is situated, an organization (covid-19 dedicated facilities, medical clinics) is located, or the geographic coverage of a disease.
domain: Class
  union of: Disease
  union of: Agent
range: Place
inverse of: isLocationFor

hasMember
type: ObjectProperty
domain: Group
range: Agent
inverse of: isMemberOf

hasNeighbor
type: ObjectProperty
sub property of: has relationships

hasNephew
type: ObjectProperty
comment: A son of your brother or sister.
sub property of: kinsman

hasNiece
type: ObjectProperty
comment: A daughter of your brother or sister.
sub property of: kinswomen

province
type: ObjectProperty
range: Province
sub property of: contained in

has relationships
type: ObjectProperty
comment: A generic property to store the relationships between persons.
domain: Person
range: Person

roommate
type: ObjectProperty
type: SymmetricProperty
comment: An associate who shares a room with you.
sub property of: hasCloseRelationship

hasSister
type: ObjectProperty
comment: A female person who has the same parents as another person.
sub property of: hasSibling
sub property of: kinswomen

spouse
type: ObjectProperty
type: SymmetricProperty
comment: Two persons in married relationship.
sub property of: hasCloseRelationship
sub property of: hasFamilyMember

has statistics
type: ObjectProperty
comment: A generic property to connect to the metrics related to the casualities of the disease.
domain: Place
range: Statistics
inverse of: is covid-19 statistics of

has symptom
type: ObjectProperty
comment: Any sensation or change in bodily function that is experienced by a patient and is associated with a particular disease.
domain: Patient
range: Symptom

has test result
type: ObjectProperty
comment: A patient has clinical test result.
domain: Patient
range: Test result
inverse of: is test result for

hasUncle
type: ObjectProperty
comment: The brother of your father or mother; the husband of your aunt.
sub property of: kinsman

has union territory
type: ObjectProperty
sub property of: contained in

hasWife
type: ObjectProperty
domain: Man
range: Woman
sub property of: spouse

Heart rate
type: DatatypeProperty
type: FunctionalProperty
comment: The rate at which the heart beats; usually measured to obtain a quick evaluation of a person's health.
domain: Vital signs
range: integer

height
type: DatatypeProperty
type: FunctionalProperty
domain: Person
range: decimal

no. of icu bed shortage
type: DatatypeProperty
comment: no. of icu bed shortage.
domain: Statistics
range: integer
sub property of: resource

no. of icu beds needed
type: DatatypeProperty
comment: no. of invasive ventilators needed.
domain: Statistics
range: integer
sub property of: resource

no. of invasive ventilators needed
type: DatatypeProperty
comment: no. of invasive ventilators needed.
domain: Statistics
range: integer
sub property of: resource

is covid-19 statistics of
type: ObjectProperty

is diagnosis of
type: ObjectProperty

isMemberOf
type: ObjectProperty
domain: Agent
range: Group
sub property of: topObjectProperty

is test result for
type: ObjectProperty

karntStateStat000001
type: NamedIndividual
type: State wise statistics
type: Statistics
cases: 10
is covid-19 statistics of: Karnataka
metrics: 10

karntStateStat000002
type: NamedIndividual
type: State wise statistics
type: Statistics
cases: 10
is covid-19 statistics of: Karnataka
metrics: 10

kinsman
type: ObjectProperty
comment: A male relative.
range: Man
sub property of: hasFamilyMember

kinswomen
type: ObjectProperty
comment: A female relative.
range: Woman
sub property of: hasFamilyMember

laboratory test finding
type: ObjectProperty
comment: Patient's covid-19 clinical test result.
range: Laboratory test finding
sub property of: has test result

metrics
type: DatatypeProperty
comment: A generic property to provide the result related to the covid-19 disease casualties and resources.
domain: Statistics

most recent test result
type: ObjectProperty
comment: The most recent covid-19 clinical test result.
range: Vital signs
sub property of: has test result

next test result
type: ObjectProperty
comment: The next clinical test result of a patient.
inverse of: previous test result

noOfPeopleMigrated
type: DatatypeProperty
comment: Number of people migrated after recovery from the covid.
comment: number of people migrated
domain: Statistics
range: integer
sub property of: cases

p000001
type: NamedIndividual
type: Diagnosed With COVID-19
type: Man
type: TestData
type: Agent
type: Person
type: Patient
had covid test: true
has diagnosis: P000001Diagnosis
case id: T1
has symptom: Fever
has symptom: URTI
has test result: P000001-Vitals1
most recent test result: P000001-Vitals1
has gender: Male

p000002
type: NamedIndividual
type: Diagnosed With COVID-19
type: TestData
type: Agent
type: Person
type: Patient
had covid test: true
has diagnosis: P000002Diagnosis
case id: T2
has symptom: Pneumonia
has test result: P000002-Vitals1
most recent test result: P000002-Vitals1

p000003
type: NamedIndividual
type: Diagnosed With COVID-19
type: TestData
type: Agent
type: Person
type: Patient
had covid test: true
has diagnosis: P000003Diagnosis
case id: T3
has symptom: SeverePneumonia
has test result: P000003-Vitals1
has test result: P000003-Vitals2
has test result: P000003-Vitals3
has test result: P000003-Vitals4
most recent test result: P000003-Vitals4

p000004
type: NamedIndividual
type: TestData
type: Untested for COVID-19
type: Agent
type: Person
type: Patient
had covid test: false
case id: T4

p000005
type: NamedIndividual
type: TestData
type: Untested for COVID-19
type: Agent
type: Person
type: Patient
had covid test: false
case id: T5

p000006
type: NamedIndividual
type: TestData
type: Untested for COVID-19
type: Agent
type: Person
type: Patient
had covid test: false
case id: T6

p000007
type: NamedIndividual
type: TestData
type: Untested for COVID-19
type: Agent
type: Person
type: Patient
had covid test: false
case id: T7

p000008
type: NamedIndividual
type: TestData
type: Untested for COVID-19
type: Woman
type: Agent
type: Person
type: Patient
had covid test: false
case id: T8
has gender: Female

p000009
type: NamedIndividual
type: TestData
type: Agent
type: Person
type: Patient
had covid test: true
case id: T9

p000010
type: NamedIndividual
type: TestData
type: Untested for COVID-19
type: Agent
type: Person
had covid test: false
case id: T10

p000011
type: NamedIndividual
type: TestData
type: Agent
type: Person
type: Patient
had covid test: true
case id: T11

p000012
type: NamedIndividual
type: TestData
type: Untested for COVID-19
type: Agent
type: Person
had covid test: false
case id: T12

p000013
type: NamedIndividual
type: TestData
type: Agent
type: Person
type: Patient
case id: T13

p000014
type: NamedIndividual
type: TestData
type: Agent
type: Person
type: Patient
case id: T14

p000015
type: NamedIndividual
type: TestData
type: Agent
type: Person
type: Patient
case id: T15

p000016
type: NamedIndividual
type: TestData
type: Agent
type: Person
type: Patient
case id: T16

p000018
type: NamedIndividual
type: TestData
type: Agent
type: Person
type: Patient
case id: T18

p000019
type: NamedIndividual
type: TestData
type: Agent
type: Person
type: Patient
case id: T19

p000020
type: NamedIndividual
type: TestData
type: Agent
type: Person
type: Patient
case id: T20

p000017
type: NamedIndividual
type: TestData
type: Agent
type: Person
type: Patient
case id: T17
comment: Note: had to give this test data id that may conflict with real data in order to process reason strings that require numeric computations on the ID's. I.e., they have to be numeric strings that can be converted to integers not string starting with "T" So make sure to delete this and similar test data before loading actual data.

p99992
type: NamedIndividual
type: TestData
type: Agent
type: Person
type: Patient
case id: 99992
comment: Note: had to give this test data id that may conflict with real data in order to process reason strings that require numeric computations on the ID's. I.e., they have to be numeric strings that can be converted to integers not string starting with "T" So make sure to delete this and similar test data before loading actual data.

p99993
type: NamedIndividual
type: TestData
type: Agent
type: Person
type: Patient
case id: 99993
comment: Note: had to give this test data id that may conflict with real data in order to process reason strings that require numeric computations on the ID's. I.e., they have to be numeric strings that can be converted to integers not string starting with "T" So make sure to delete this and similar test data before loading actual data.

permanentResident
type: ObjectProperty
comment: The Place (typically a City but could be a building, State, etc.) that a Person has as their permanent home.
domain: Person
range: Place

population density
type: DatatypeProperty
type: FunctionalProperty
comment: For humans, population density is the number of people per unit of area, usually quoted per square kilometre or square mile, and which may include or exclude for example areas of water or glaciers.
domain: Place
range: decimal

previous test result
type: ObjectProperty
comment: The previous clinical test result of a patient.
domain: Vital signs
range: Vital signs

recovered
type: DatatypeProperty
comment: Number of people recovered from covid.
domain: Statistics
range: integer
sub property of: cases

date of discharge
type: DatatypeProperty
comment: The patient released on a day from a covid dedicated facility.
domain: Patient
range: dateTime
sub property of: date
alternative label: out date
alternative label: released on

resource
type: DatatypeProperty
comment: Available/ required resource for covid treatment.
domain: Statistics
sub property of: metrics

respiratory rate
type: DatatypeProperty
type: FunctionalProperty
comment: Is the number of breaths a person take per minute.
domain: Vital signs
range: integer

security guard
type: ObjectProperty
comment: A security guard of a person.
sub property of: has relationships

source
type: DatatypeProperty
comment: The data source based on which the statistics produced.
domain: Statistics
range: Datatype
  union of: anyURI
  union of: string

state code
type: DatatypeProperty
comment: State (province) code. Example, "KL" of Kerala.
domain: State
range: string

state wise patient ID
type: DatatypeProperty
type: FunctionalProperty
comment: The patient ID assigned at the state/province level.
range: string
sub property of: case id

state wise statistics
type: ObjectProperty
comment: A property to connect to the state (province) wise metrics related to the casualities of the disease.
domain: State
range: State wise statistics
sub property of: has statistics

suspected reasons of catching covid-19
type: ObjectProperty
comment: The suspected reasons of catching covid-19 disease, for example, travel, attending a marriage anniversary, while treating a patient, infected famility member.
domain: Patient
range: Exposure to COVID-19

temperature
type: DatatypeProperty
type: FunctionalProperty
comment: The body temperature.
domain: Vital signs
range: decimal

test result on
type: DatatypeProperty
comment: The test result date.
domain: Test result
range: dateTime
sub property of: date

travel history
type: ObjectProperty
comment: A generic property to store the travel history of a patient. Also used to record the Place that a Patient traveledFrom on ExposureToCovid19 individuals.
domain: Class
  union of: Exposure to COVID-19
  union of: Person
range: Place
sub property of: topObjectProperty

travelled from
type: ObjectProperty
comment: A suspected covid-19 patient travelled from a place, e.g., country/ state/ district.
range: Place
sub property of: travel history

travelled to
type: ObjectProperty
comment: A suspected covid-19 patient travelled to a place, e.g., country/ state/ district.
range: Place
sub property of: travel history

Bengalure Urban
type: NamedIndividual
type: State wise statistics
type: Statistics
cases: 15
is covid-19 statistics of: UP
metrics: 15

utilityEntity
type: AnnotationProperty
comment: Used to mark any entity (only data properties now) that is meant for processing data but is not part of the deployed model

weight
type: DatatypeProperty
type: FunctionalProperty
comment: The weight.
domain: Person
range: decimal

Agent
type: Class
comment: An agent (eg. person, group, software or physical artifact).

Organization
type: Class
comment: A group of people who work together.
subclass of: Group

Person
type: Class
comment: A human being.
subclass of: Agent

name
type: DatatypeProperty
comment: A name for some thing.
range: string

has gender
type: ObjectProperty
type: FunctionalProperty
comment: Gender of a person.
domain: Person
range: Gender type

Country
type: Class
comment: A country.
subclass of: Place

Gender type
type: Class
comment: An enumeration of genders.
equivalent class: Class
  one of: Female
  one of: Male

Infectious disease
type: Class
comment: An infectious disease is a clinically evident human disease resulting from the presence of pathogenic microbial agents, like pathogenic viruses, pathogenic bacteria, fungi, protozoa, multicellular parasites, and prions. To be considered an infectious disease, such pathogens are known to be able to cause this disease.
comment: SCTID: 40733004
subclass of: Disease

Patient
type: Class
comment: A patient is any person recipient of health care services.
comment: Patients are categorised into three groups based on the following guidelines. Source: https://www.mohfw.gov.in/pdf/FinalGuidanceonMangaementofCovidcasesversion2.pdf
comment: SCTID: 116154003
subclass of: Person
subclass of: Restriction
  on property: has diagnosis
  some values from: Diagnosis

Place
type: Class
comment: Entities that have a somewhat fixed, physical extension.

State
type: Class
comment: A state or province of a country.
subclass of: Place

address
type: DatatypeProperty
comment: Physical address of the item.
domain: Class
  union of: Organization
  union of: Person
range: string

address locality
type: DatatypeProperty
comment: The locality in which the street address is, and which is in the region. For example, BHEL Layout.
range: string
sub property of: address

latitude
type: DatatypeProperty
type: FunctionalProperty
comment: The latitude of a location. For example 37.42242
domain: Place
range: decimal

longitude
type: DatatypeProperty
type: FunctionalProperty
comment: The longitude of a location. For example -122.08585.
domain: Place
range: decimal

nationality
type: ObjectProperty
comment: Nationality of the person.
domain: Person
range: Country

postal code
type: DatatypeProperty
comment: The postal code. For example, 560060
range: string
sub property of: address

street address
type: DatatypeProperty
comment: The street address. For example, 1st Main, Muthurainagara.
range: string
sub property of: address