mod
type: Ontology
version iri: http://www.isibang.ac.in/ns/mod/1.2
status: This version MOD 1.2 is a stable version.
abstract: MOD provides a set of terms which can be used by the ontology developers, ontology libraries (e.g., ontology registry, ontology repository, ontology portal), and in general by the Web developers to describe and publish the ontologies. The enriched description of ontologies, in turn, will help the users to search, discover, identify and select the required ontologies. This will ultimately promote the reuse of ontologies.
contributor: Anne Toulet
creator: Biswanath Dutta
creator: Clement Jonquet
license: MOD is licensed under the Creative Commons Attribution 4.0 For details, see here: https://github.com/sifrproject/MOD-Ontology/blob/master/LICENSE
title: MOD: Metadata for Ontology Description and publication
title: MOD: Métadonnées pour l'ontologie Description et publication @fr
preferred namespace prefix: mod
preferred namespace uri: http://www.isibang.ac.in/ns/mod#
mod:sample queries: For sample SPARQL quesries to query MOD OWL knowledge base, see here: https://github.com/sifrproject/MOD-Ontology/blob/master/SPARQL_Queries_on_MOD_1.2.3-with-instances.txt
version info: This is MOD 1.2.

VersionInfo
type: AnnotationProperty
comment: The version of the released ontology.

conforms to knowledge representation paradigm
type: ObjectProperty
domain: Ontology
range: Knowledge representation paradigm
description: A representation formalism that is followed to describe knowledge in an ontology. Example includes description logics, first order logic, etc. dct: An established standard to which the described resource conforms.
relation: dc:relation

endorsed by
type: ObjectProperty
domain: Ontology
range: Agent
description: The parties that have expressed support or approval to this ontology.

has formality level
type: ObjectProperty
domain: Ontology
range: Formality level
description: The level of formality of an ontology.

has ontology language
type: ObjectProperty
domain: Ontology
range: Ontology language
description: A language that is used to create an ontology.

has ontology syntax
type: ObjectProperty
domain: Ontology
range: Ontology syntax
description: The syntax followed in the creation of an ontology.

is of type
type: ObjectProperty
domain: Ontology
range: Ontology type
description: The nature of the content of the ontology.

used ontology engineering methodology
type: ObjectProperty
domain: Ontology
range: Ontology engineering methodology
description: A methodolgy follwoing which an ontology is created.

used ontology engineering tool
type: ObjectProperty
domain: Ontology
range: Ontology engineering tool
description: The tool used for the creation of an ontology.

access rights
type: ObjectProperty
domain: Ontology
range: Rights Statement
description: Information about who can access the resource or an indication of its security status.
relation: mod:accessibility (defined in mod1.0)

accrual method
type: ObjectProperty
domain: Ontology
range: Method of accrual
description: The method by which items are added to a collection.

accrual periodicity
type: ObjectProperty
domain: Ontology
range: Frequency
description: The frequency with which items are added to a collection.

accrual policy
type: ObjectProperty
domain: Ontology
range: Policy
description: The policy governing the addition of items to a collection.

audience
type: ObjectProperty
domain: Ontology
range: Agent
description: A class of entity for whom the resource is intended or useful.

contributor
type: ObjectProperty
domain: Ontology
range: Agent
description: An entity responsible for making contributions to the resource.

creator
type: ObjectProperty
domain: Ontology
description: An entity primarily responsible for making the resource.

has part
type: ObjectProperty
sub property of: relation
inverse of: is part of
description: A related resource that is included either physically or logically in the described resource.

is part of
type: ObjectProperty
sub property of: relation
domain: Ontology
range: Ontology
description: A related resource in which the described resource is physically or logically included.

license
type: ObjectProperty
domain: Ontology
range: License document
description: A legal document giving official permission to do something with the resource.

publisher
type: ObjectProperty
domain: Ontology
range: Organization
description: An entity responsible for making the resource available.

relation
type: ObjectProperty
domain: Ontology
range: Ontology
description: A related resource.

rights holder
type: ObjectProperty
domain: Thing
range: Agent
description: A person or organization owning or managing rights over the resource.

curated by
type: ObjectProperty
domain: Ontology
range: Person
description: A curator who restructure the previously authored content and shape it to be appropriate for the intended representation (e.g. by normalizing the fields for being represented in a spreadsheet).

evaluated by
type: ObjectProperty
domain: Ontology
range: Agent
description: An ontology that has been evaluated by an agent.

group
type: ObjectProperty
domain: Ontology
range: Group
description: A group of ontologies that the ontology is usually considered into.

ontology in use
type: ObjectProperty
domain: Ontology
range: Project
description: An ontology that is used in a project.

ontology related to
type: ObjectProperty
domain: Ontology
range: Ontology

backward compatible with
type: ObjectProperty
domain: Ontology
range: Ontology
description: This identifies the specified ontology as a prior version of the containing ontology, and further indicates that it is backward compatible with it.

incompatible with
type: ObjectProperty
domain: Ontology
range: Ontology
description: This indicates that the containing ontology is a later version of the referenced ontology, but is not backward compatible with it.

generalization of
type: ObjectProperty
sub property of: ontology related to
inverse of: specialization of

specialization of
type: ObjectProperty
sub property of: ontology related to
description: An entity that is a specialization of another shares all aspects of the latter, and additionally presents more specific aspects of the same thing as the latter.

was generated by
type: ObjectProperty
domain: Ontology
range: Activity
description: Generation is the completion of production of a new entity by an activity. This entity did not exist before generation and becomes available for usage after this generation.

was invalidated by
type: ObjectProperty
domain: Ontology
range: Activity
description: Invalidation is the start of the destruction, cessation, or expiry of an existing entity by an activity. The entity is no longer available for use (or further invalidation) after invalidation. Any generation or usage of an entity precedes its invalidation.

funded by
type: ObjectProperty
domain: Ontology
range: Agent
description: An ontology that is sponsored by and developed under a project.

uri
type: DatatypeProperty
domain: Ontology
range: anyURI
description: The URI of the ontology which is described by this metadata.

acronym
type: DatatypeProperty
range: string
description: A short name by which an ontology is formally known.

designed for ontology task
type: DatatypeProperty
domain: Ontology
range: string
description: The purpose for which the ontology was originally designed.

has domain
type: DatatypeProperty
domain: Ontology
range: string
description: The domain can refer to the established topic hierarchies such as the general purpose topic hierarchy DMOZ or the domain specific topic hierarchy ACM for the computer science domain.

key classes
type: DatatypeProperty
domain: Ontology
range: string
description: Representative classes in the ontology.

keywords
type: DatatypeProperty
domain: Ontology
range: string
description: A keyword(s) is used to describe the content of an ontology.

known usage
type: DatatypeProperty
domain: Ontology
range: string
description: The applications where the ontology is being used.

number of axioms
type: DatatypeProperty
domain: Ontology
range: nonNegativeInteger
description: The total number of axioms in an ontology.

number of classes
type: DatatypeProperty
domain: Ontology
range: nonNegativeInteger
description: The total number of classes in an ontology.

number of individuals
type: DatatypeProperty
domain: Ontology
range: nonNegativeInteger
description: The total number of individuals in an ontology.

number of properties
type: DatatypeProperty
domain: Ontology
description: The total number of properties in an ontology.

resource locator
type: DatatypeProperty
domain: Ontology
range: anyURI
description: The location where the ontology can be found. It should be accessible via a URL. It can be the same as the value for URI property.

status
type: DatatypeProperty
domain: Ontology
range: string
description: The tracking information for the contents of the ontology.

abstract
type: DatatypeProperty
domain: Ontology
range: string
description: A summary of the resource.

alternative title
type: DatatypeProperty
domain: Ontology
range: string
description: An alternative name for the resource.

bibliographic citation
type: DatatypeProperty
domain: Ontology
range: string
description: A bibliographic reference for the resource.

coverage
type: DatatypeProperty
domain: Ontology
range: string
description: The spatial or temporal topic of the resource, the spatial applicability of the resource, or the jurisdiction under which the resource is relevant.

date created
type: DatatypeProperty
sub property of: date
domain: Ontology
range: dateTime
description: Date of creation of the resource.

date
type: DatatypeProperty
description: A point or period of time associated with an event in the lifecycle of the resource.

date submitted
type: DatatypeProperty
sub property of: date
domain: Ontology
range: dateTime
description: Date of submission of the resource.

description
type: DatatypeProperty
domain: Thing
range: string
description: An account of the resource.

has format
type: DatatypeProperty
domain: Ontology
range: anyURI
description: A related resource that is substantially the same as the pre-existing described resource, but in another format.

has version
type: DatatypeProperty
domain: Ontology
range: anyURI
description: A related resource that is a version, edition, or adaptation of the described resource.

identifier
type: DatatypeProperty
domain: Ontology
range: anyURI
description: An unambiguous reference to the resource within a given context.

is format of
type: DatatypeProperty
domain: Ontology
range: anyURI
description: A related resource that is substantially the same as the described resource, but in another format.

language
type: DatatypeProperty
domain: Ontology
range: anyURI
description: A language of the resource.

date modified
type: DatatypeProperty
sub property of: date
domain: Ontology
range: dateTime
description: Date on which the resource was changed.

source
type: DatatypeProperty
domain: Ontology
range: string
description: A related resource from which the described resource is derived.

subject
type: DatatypeProperty
domain: Ontology
range: string
description: The topic of the resource.

title
type: DatatypeProperty
domain: Ontology
range: string
description: A name given to the resource.

date valid
type: DatatypeProperty
sub property of: date
domain: Ontology
range: dateTime
description: Date (often a range) of validity of a resource.

curated on
type: DatatypeProperty
sub property of: date
domain: Ontology
range: dateTime
description: Specifies the date this resource was curated. pav:curatedBy gives the agents that performed the curation.

changes
type: DatatypeProperty
domain: Ontology
range: anyURI
description: A reference to a resource that describes changes between this version of a vocabulary and the previous.

example
type: DatatypeProperty
domain: Ontology
range: anyURI
description: A reference to a resource that provides an example of how this resource can be used.

preferred namespace prefix
type: DatatypeProperty
domain: Ontology
range: string
description: The preferred namespace prefix to use when using terms from this vocabulary in an XML document.

preferred namespace URI
type: DatatypeProperty
domain: Ontology
range: anyURI
description: The preferred namespace URI to use when using terms from this vocabulary in an XML document.

bug database
type: DatatypeProperty
domain: Ontology
range: anyURI
description: Bug tracker for a project.

mailing list
type: DatatypeProperty
domain: Thing
range: anyURI
description: Mailing list home page or email address.

repository
type: DatatypeProperty
domain: Ontology
range: anyURI
description: Source code repository.

address
type: DatatypeProperty
domain: Agent
range: string

browsing ui
type: DatatypeProperty
domain: Ontology
range: anyURI
description: The user interface (URL) where the ontology may be browsed or searched.

byte size
type: DatatypeProperty
domain: Ontology
range: nonNegativeInteger
description: The byte size of an ontology.

city
type: DatatypeProperty
sub property of: address

competency question
type: DatatypeProperty
domain: Ontology
range: string
description: A set of questions made to build an ontology at the design time.

Number Of Data Properties
type: DatatypeProperty
sub property of: number of properties
range: nonNegativeInteger
description: The total number of data properties in an ontology.

number of labels
type: DatatypeProperty
domain: Ontology
range: nonNegativeInteger
description: Number of defined labels for any resources in an ontology (classes, properties, etc).

Number Of Object Properties
type: DatatypeProperty
sub property of: number of properties
range: nonNegativeInteger
description: The total number of object properties in an ontology.

postal code
type: DatatypeProperty
sub property of: address

root classes
type: DatatypeProperty
domain: Ontology
range: anyURI
description: This property is to provide the root class(es) of an ontology. This is automatically populated by taking the direct subclasses of owl:Thing If the ontology is also defined as a unique skos:ConceptScheme, then this property should become equivalent of skos:hasTopConcept

sample queries
type: DatatypeProperty
domain: Ontology
range: string
description: A set of queries (may be SPARQL, DL Queries) that are provided along with an ontology.

state
type: DatatypeProperty
sub property of: address

street address
type: DatatypeProperty
sub property of: address

translation
type: DatatypeProperty
domain: Ontology
range: anyURI
description: A pointer to the translated ontology(ies) for an existing ontology.

vocabulary used
type: DatatypeProperty
domain: Ontology
range: anyURI
description: A vocabulary(ies) that is used and/or referred to create the current ontology.

comment
type: DatatypeProperty
domain: Ontology
range: string
description: Is used to provide a human-readable description of a resource.

deprecated
type: DatatypeProperty
domain: Ontology
range: boolean
description: An annotation with the owl:deprecated annotation property and the value equal to "true"^^xsd:boolean can be used to specify that an IRI is deprecated.

imports
type: DatatypeProperty
domain: Ontology
range: anyURI
description: References to another OWL ontology containing definitions, whose meaning is considered to be part of the meaning of the importing ontology.

prior version
type: DatatypeProperty
domain: Ontology
range: anyURI
description: This identifies the specified ontology as a prior version of the containing ontology.

version iri
type: DatatypeProperty
domain: Ontology
range: anyURI
description: The property that identifies the version IRI of an ontology.

version info
type: DatatypeProperty
domain: Ontology
range: string
description: The annotation property that provides version information for an ontology or another OWL construct

endpoint
type: DatatypeProperty
domain: Ontology
range: anyURI
description: Relates an instance of sd:Service to a SPARQL endpoint that implements the SPARQL Protocol service for the service. The object of the sd:endpoint property is an IRI.

depiction
type: DatatypeProperty
domain: Ontology
range: anyURI
description: A depiction of some thing.

first name
type: DatatypeProperty
domain: Person
range: string

homepage
type: DatatypeProperty
domain: Thing
range: anyURI
description: An unambiguous reference to the resource within a given context.

last name
type: DatatypeProperty
domain: Agent
range: string
description: The last name of a person.

logo
type: DatatypeProperty
domain: Ontology
range: anyURI
description: A logo representing some thing.

personal mailbox
type: DatatypeProperty
range: anyURI
description: A personal mailbox, ie. an Internet mailbox associated with exactly one owner, the first owner of this mailbox. This is a 'static inverse functional property', in that there is (across time and change) at most one individual that ever has any particular value for foaf:mbox.

name
type: DatatypeProperty
domain: Thing
range: string
description: A name for some thing.

page
type: DatatypeProperty
domain: Thing
range: anyURI
description: A link to the documentation page on a thing.

phone
type: DatatypeProperty
domain: Agent
range: string

Formality level
type: Class
description: The level of formality of an ontology.

Knowledge representation paradigm
type: Class
description: Information about a knowledge representation paradigm a particular language adheres to.

Ontology engineering methodology
type: Class
description: Information about the ontology engineering methodology.

Ontology engineering tool
type: Class
description: A tool used to create the ontology.

Ontology language
type: Class
description: Information about the language in which the ontology is implemented.

Ontology syntax
type: Class
description: A syntax that is used to implement an ontology. Example includes RDF/XML, Notation3, n-triples, RDFa and Turtle.

Ontology type
type: Class
description: This class subsumes types of ontologies according to well-known classifications in the Ontology Engineering literature.

Frequency
type: Class
description: A rate at which something recurs.

License document
type: Class
subclass of: Rights Statement
description: A legal document giving official permission to do something with a Resource.

Method of accrual
type: Class
description: A method by which resources are added to a collection.

Policy
type: Class
description: A plan or course of action by an authority, intended to influence and determine decisions, actions, and other matters.

Rights Statement
type: Class
description: A statement about the intellectual property rights (IPR) held in or over a Resource, a legal document giving official permission to do something with a resource, or a statement about access rights.

Group
type: Class
description: A group of ontologies that the ontology is usually considered into.

Ontology
type: Class
subclass of: Restriction
  on property: conforms to knowledge representation paradigm
  all values from: Knowledge representation paradigm
subclass of: Restriction
  on property: has formality level
  all values from: Formality level
subclass of: Restriction
  on property: has ontology language
  all values from: Ontology language
subclass of: Restriction
  on property: has ontology syntax
  all values from: Ontology syntax
subclass of: Restriction
  on property: used ontology engineering methodology
  all values from: Ontology engineering methodology
subclass of: Restriction
  on property: used ontology engineering tool
  all values from: Ontology engineering tool
subclass of: Restriction
  on property: creator
  all values from: Agent
subclass of: Restriction
  on property: creator
  min qualified cardinality: 1
  on class: Agent
subclass of: Restriction
  on property: has formality level
  max cardinality: 1
subclass of: Restriction
  on property: has ontology syntax
  max cardinality: 1
subclass of: Restriction
  on property: uri
  all values from: anyURI
subclass of: Restriction
  on property: designed for ontology task
  all values from: string
subclass of: Restriction
  on property: key classes
  all values from: string
subclass of: Restriction
  on property: keywords
  all values from: string
subclass of: Restriction
  on property: resource locator
  all values from: anyURI
subclass of: Restriction
  on property: date created
  all values from: dateTime
subclass of: Restriction
  on property: language
  all values from: anyURI
subclass of: Restriction
  on property: title
  all values from: string
subclass of: Restriction
  on property: designed for ontology task
  min cardinality: 1
subclass of: Restriction
  on property: key classes
  min cardinality: 1
subclass of: Restriction
  on property: keywords
  min cardinality: 1
subclass of: Restriction
  on property: title
  min cardinality: 1
subclass of: Restriction
  on property: date created
  cardinality: 1
subclass of: Restriction
  on property: uri
  max qualified cardinality: 1
  on data range: anyURI
subclass of: Restriction
  on property: resource locator
  max cardinality: 1
description: By ontology, we not only refers the OWL structure that respects all the conditions to be referred as a fully formalized ontology but also every ontology like structure that formalizes some knowledge (e.g., thesaurus, taxonomy, metadata vocabulary).

Activity
type: Class
description: An activity is something that occurs over a period of time and acts upon or with entities; it may include consuming, processing, transforming, modifying, relocating, using, or generating entities.

Agent
type: Class
description: An agent (eg. person, group, software or physical artifact).

Organization
type: Class
subclass of: Agent
description: An organization.

Person
type: Class
subclass of: Agent
description: A person.

Project
type: Class
subclass of: Restriction
  on property: title
  all values from: string
description: A project (a collective endeavour of some kind).